Acridine, 9,10-dihydro-
- Formula: C13H11N
- Molecular weight: 181.2331
- IUPAC Standard InChIKey: HJCUTNIGJHJGCF-UHFFFAOYSA-N
- CAS Registry Number: 92-81-9
- Chemical structure:
View 3d structure (requires JavaScript / HTML 5) - Other names: Acridan; Acridane; Carbazine; 9,10-Dihydroacridine

Reaction thermochemistry data

Data compiled by: Hussein Y. Afeefy, Joel F. Liebman, and Stephen E. Stein
Individual Reactions
By formula: H2 + C13H9N = C13H11N
Quantity | Value | Units | Method | Reference | Comment |
---|---|---|---|---|---|
ΔrH° | 18.0 | kcal/mol | Cm | Jackman and Packham, 1957 | liquid phase; solvent: bis-2-Ethoxyethyl ether |

Gas phase ion energetics data

Data compiled as indicated in comments:
LLK - Sharon G. Lias, Rhoda D. Levin, and Sherif A. Kafafi
RDSH - Henry M. Rosenstock, Keith Draxl, Bruce W. Steiner, and John T. Herron
Ionization energy determinations
IE (eV) | Method | Reference | Comment |
---|---|---|---|
7.24 ± 0.03 | PI | Potapov, Filyugina, et al., 1968 | RDSH |
7.33 | PE | Haink, Adams, et al., 1974 | Vertical value; LLK |

Lee's RI, non-polar column, temperature ramp

View large format table.

Column type Active phase I Reference Comment
CapillaryHP-5279.0Wang, Hou, et al., 200730. m/0.30 mm/0.25 μm, Helium, 50. C @ 5. min, 5. K/min, 200. C @ 15. min
CapillarySE-52304.11Vassilaros, Kong, et al., 198220. m/0.30 mm/0.25 μm, H2, 40. C @ 2. min, 4. K/min; Tend: 265. C
CapillarySE-52304.33Lee, Vassilaros, et al., 197912. m/0.3 mm/0.34 μm, He, 2. K/min; Tstart: 50. C; Tend: 250. C

References

Jackman and Packham, 1957
Jackman, L.M.; Packham, D.I.,
The experimental resonance energy of acridine,
Proc. Chem. Soc., London, 1957, 349-350. [all data]
Potapov, Filyugina, et al., 1968
Potapov, V.K.; Filyugina, A.D.; Shigorin, D.N.; Ozerova, G.A.,
Photoionization of some compounds containing the carbonyl and amino groups,
Dokl. Akad. Nauk SSSR, 1968, 180, 398, In original 352. [all data]
Haink, Adams, et al., 1974
Haink, H.J.; Adams, J.E.; Huber, J.R.,
The electronic structure of aromatic amines: photoelectron spectroscopy of diphenylamine, iminobibenzyl, acridan and carbazole,
Ber. Bunsen-Ges. Phys. Chem., 1974, 78, 436. [all data]