(CH3)2NSSN(CH3)2
- Formula: C4H12N2S2
- Molecular weight: 152.281
- IUPAC Standard InChIKey: MUPAEPGUCZXFAU-UHFFFAOYSA-N
- CAS Registry Number: 928-05-2
- Chemical structure:
View 3d structure (requires JavaScript / HTML 5) - Other names: Bis(dimethylamino)disulfide; Dimethylamino disulfide; Methyl(dimethylamino)disulfide

Gas phase ion energetics data

Data compiled as indicated in comments:
LLK - Sharon G. Lias, Rhoda D. Levin, and Sherif A. Kafafi
Ionization energy determinations
IE (eV) | Method | Reference | Comment |
---|---|---|---|
7.2 | PE | Bock, Schulz, et al., 1981 | LLK |
8.02 | PE | Bock, Schulz, et al., 1981 | Vertical value; LLK |

Normal alkane RI, non-polar column, temperature ramp

Column type | Active phase | I | Reference | Comment |
---|---|---|---|---|
Capillary | OV-101 | 904. | Zenkevich, 2005 | 25. m/0.20 mm/0.10 μm, N2/He, 6. K/min; Tstart: 50. C; Tend: 250. C |

References

Bock, Schulz, et al., 1981
Bock, H.; Schulz, W.; Stein, U.,
Radikalionen, 47. Notiz: Die strukturanderung wahrend der einelektronen-oxidation von bis(dimethylamino)disulfid,
Chem. Ber., 1981, 114, 2632. [all data]
Zenkevich, 2005
Zenkevich, I.G.,
Experimentally measured retention indices., 2005. [all data]