Diazene, bis(1,1-dimethylethyl)-
- Formula: C8H18N2
- Molecular weight: 142.2419
- IUPAC Standard InChIKey: GKCPCPKXFGQXGS-UHFFFAOYSA-N
- CAS Registry Number: 927-83-3
- Chemical structure:

Gas phase thermochemistry data

Data compiled by: Hussein Y. Afeefy, Joel F. Liebman, and Stephen E. Stein
Quantity | Value | Units | Method | Reference | Comment |
---|---|---|---|---|---|
ΔfH°gas | -36.4 ± 2.8 | kJ/mol | Ccb | Montgomery, Engel, et al., 1978 | see Engel, Melaugh, et al., 1976, and Engel, Wood, et al., 1974 |
ΔfH°gas | -35.6 ± 3.6 | kJ/mol | Cm | Engel, 1976 |

Gas phase ion energetics data

Data compiled as indicated in comments:
LLK - Sharon G. Lias, Rhoda D. Levin, and Sherif A. Kafafi
Ionization energy determinations
IE (eV) | Method | Reference | Comment |
---|---|---|---|
8.2 ± 0.2 | PE | Bock, Wittel, et al., 1976 | Vertical value; LLK |
8.20 | PE | Houk, Chang, et al., 1975 | Vertical value; LLK |

Condensed phase thermochemistry data

Data compiled by: Hussein Y. Afeefy, Joel F. Liebman, and Stephen E. Stein

Quantity Value Units Method Reference Comment
Δfliquid-75.5 ± 2.7kJ/molCcbMontgomery, Engel, et al., 1978see Engel, Melaugh, et al., 1976, and Engel, Wood, et al., 1974
Δfliquid-74.7 ± 3.6kJ/molCmEngel, 1976
Quantity Value Units Method Reference Comment
Δcliquid-5645.1 ± 2.5kJ/molCcbMontgomery, Engel, et al., 1978see Engel, Melaugh, et al., 1976, and Engel, Wood, et al., 1974

Phase change data

Data compiled as indicated in comments:
BS - Robert L. Brown and Stephen E. Stein
TRC - Thermodynamics Research Center, NIST Boulder Laboratories, Chris Muzny director
ALS - Hussein Y. Afeefy, Joel F. Liebman, and Stephen E. Stein
DRB - Donald R. Burgess, Jr.
AC - William E. Acree, Jr., James S. Chickos
DH - Eugene S. Domalski and Elizabeth D. Hearing

Quantity Value Units Method Reference Comment
Tboil382. to 383.KN/ABuckingham and Donaghy, 1982BS
Quantity Value Units Method Reference Comment
Tfus258.6KN/AByström, 1980Crystal phase 1 phase; Uncertainty assigned by TRC = 1. K; TRC
Quantity Value Units Method Reference Comment
Δvap9.34 ± 0.06kcal/molCMontgomery, Engel, et al., 1978see Engel, Melaugh, et al., 1976, and Engel, Wood, et al., 1974; ALS
Δvap9.35kcal/molN/AMontgomery, Engel, et al., 1978DRB
Δvap9.35 ± 0.07kcal/molCEngel, Melaugh, et al., 1976AC
Δvap9.34 ± 0.06kcal/molCEngel, 1976ALS
Δvap9.35kcal/molN/AEngel, 1976DRB

Reduced pressure boiling point

Tboil (K) Pressure (atm) Reference Comment
320. to 323.0.11Buckingham and Donaghy, 1982BS

Enthalpy of vaporization

ΔvapH (kcal/mol) Temperature (K) Method Reference Comment
9.46299.UVEngel, Wood, et al., 1974Based on data from 294. to 305. K.; AC

Enthalpy of fusion

ΔfusH (kcal/mol) Temperature (K) Reference Comment
2.457258.6Byström, 1980AC

Enthalpy of phase transition

ΔHtrs (kcal/mol) Temperature (K) Initial Phase Final Phase Reference Comment
1.169242.6crystaline, IIcrystaline, IBystroem, 1980DH
2.4570258.6crystaline, I Bystroem, 1980DH

Entropy of phase transition

ΔStrs (cal/mol*K) Temperature (K) Initial Phase Final Phase Reference Comment
4.83242.6crystaline, IIcrystaline, IBystroem, 1980DH
9.49258.6crystaline, I Bystroem, 1980DH

In addition to the Thermodynamics Research Center (TRC) data available from this site, much more physical and chemical property data is available from the following TRC products:

References

Montgomery, Engel, et al., 1978
Montgomery, R.L.; Engel, P.S.; Leckonby, R.A.; Rossini, F.D.; Mansson, M.; Szilagyi, S.; Timberlake, J.W.,
Enthalpies of combustion, vaporization, and formation of 3,3,4,4-tetramethyl-Δ1-1,2-diazetine and di-tert-butyldiazene,
J. Chem. Eng. Data, 1978, 131, 129-131. [all data]
Engel, Melaugh, et al., 1976
Engel, P.S.; Melaugh, R.A.; Mansson, M.; Timberlake, J.W.; Garner, A.W.; Rossini, F.D.,
Thermochemistry of nine diazenes (azo compounds),
J. Chem. Thermodyn., 1976, 8, 607-621. [all data]
Engel, Wood, et al., 1974
Engel, P.S.; Wood, J.L.; Sweet, J.A.; Margrave, J.L.,
Thermochemistry of azoalkanes,
J. Am. Chem. Soc., 1974, 96, 2381-2387. [all data]
Engel, 1976
Engel, P.S.,
Thermochemistry of cyclic 1,2-dialkyldiazenes (azo compounds). The effect of strain energy on thermal lability,
J. Am. Chem. Soc., 1976, 98, 1972-19. [all data]
Bock, Wittel, et al., 1976
Bock, H.; Wittel, K.; Veith, M.; Wiberg, N.,
Photoelectron spectra and molecular properties. L.1-3 On the blue color of bis(trimethylsilyl)diimine,
J. Am. Chem. Soc., 1976, 98, 109. [all data]
Houk, Chang, et al., 1975
Houk, K.N.; Chang, Y.-M.; Engel, P.S.,
Photoelectron spectroscopy of azo compounds,
J. Am. Chem. Soc., 1975, 97, 1824. [all data]