3-Butyn-1-ol
- Formula: C4H6O
- Molecular weight: 70.0898
- IUPAC Standard InChIKey: OTJZCIYGRUNXTP-UHFFFAOYSA-N
- CAS Registry Number: 927-74-2
- Chemical structure:
View 3d structure (requires JavaScript / HTML 5) - Other names: 1-Butyn-4-ol; 2-Hydroxyethylacetylene; 3-Butyne-1-ol; 3-Butynol; 3-Butynyl alcohol; 4-Hydroxy-1-butyne; HC≡CCH2CH2OH; NSC 9708; but-3-yn-1-ol

Phase change data

Data compiled as indicated in comments:
BS - Robert L. Brown and Stephen E. Stein
TRC - Thermodynamics Research Center, NIST Boulder Laboratories, Chris Muzny director
AC - William E. Acree, Jr., James S. Chickos
Quantity | Value | Units | Method | Reference | Comment |
---|---|---|---|---|---|
Tboil | 401. | K | N/A | Farchan Laboratories, 1990 | BS |
Tboil | 402.2 | K | N/A | Weast and Grasselli, 1989 | BS |
Tboil | 402.05 | K | N/A | Henne and Greenlee, 1945 | Uncertainty assigned by TRC = 0.5 K; TRC |
Quantity | Value | Units | Method | Reference | Comment |
Tfus | 209.55 | K | N/A | Henne and Greenlee, 1945 | Uncertainty assigned by TRC = 0.4 K; TRC |
Quantity | Value | Units | Method | Reference | Comment |
ΔvapH° | 51.7 ± 0.9 | kJ/mol | CGC | Vélez, Quijano, et al., 2005 | Based on data from 343. to 393. K.; AC |

Gas phase ion energetics data

Data compiled as indicated in comments:
LBLHLM - Sharon G. Lias, John E. Bartmess, Joel F. Liebman, John L. Holmes, Rhoda D. Levin, and W. Gary Mallard
Ionization energy determinations
IE (eV) | Method | Reference | Comment |
---|---|---|---|
9.66 | EI | Holmes and Lossing, 1986 | LBLHLM |

Normal alkane RI, non-polar column, custom temperature program

Column type | Active phase | I | Reference | Comment |
---|---|---|---|---|
Capillary | Methyl Silicone | 660. | Zenkevich, 1996 | Program: not specified |

References

Farchan Laboratories, 1990
Farchan Laboratories,
Research Chemicals Catalog, Farchan Laboratories, Gainesville, FL, 1990, 91. [all data]
Weast and Grasselli, 1989
CRC Handbook of Data on Organic Compounds, 2nd Editon, Weast,R.C and Grasselli, J.G., ed(s)., CRC Press, Inc., Boca Raton, FL, 1989, 1. [all data]
Henne and Greenlee, 1945
Henne, A.L.; Greenlee, K.W.,
Preparation and Physical Constants of Acetylenic Compounds,
J. Am. Chem. Soc., 1945, 67, 484-5. [all data]
Vélez, Quijano, et al., 2005
Vélez, Ederley; Quijano, Jairo; Gaviria, Jair; Roux, María Victoria; Jiménez, Pilar; Temprado, Manuel; Martín-Valcárcel, Gloria; Pérez-Parajón, Juan; Notario, Rafael,
Calorimetric and Computational Study of 3-Buten-1-ol and 3-Butyn-1-ol. Estimation of the Enthalpies of Formation of 1-Alkenols and 1-Alkynols,
J. Phys. Chem. A, 2005, 109, 34, 7832-7838, https://doi.org/10.1021/jp051161y
. [all data]
Holmes and Lossing, 1986
Holmes, J.L.; Lossing, F.P.,
Title unavailable,
Personal communication to S.G. Lias, 1986. [all data]
Zenkevich, 1996
Zenkevich, I.G.,
Informational Maitenance of Gas Chromatographic Identification of Organic Compounds in Ecoanalytical Investigations,
Z. Anal. Chem., 1996, 51, 11, 1140-1148. [all data]