4,7-Ethanobenzo[b]thiophene, 2,3,3a,4,7,7a-hexahydro-1,1-dioxide
- Formula: C10H14O2S
- Molecular weight: 198.282
- CAS Registry Number: 92688-81-8

Gas phase ion energetics data

Data compiled as indicated in comments:
LBLHLM - Sharon G. Lias, John E. Bartmess, Joel F. Liebman, John L. Holmes, Rhoda D. Levin, and W. Gary Mallard
Ionization energy determinations
IE (eV) | Method | Reference | Comment |
---|---|---|---|
9.2 | PE | Aitken, Gosney, et al., 1984 | LBLHLM |
9.8 | PE | Aitken, Gosney, et al., 1984 | Vertical value; LBLHLM |

References

Aitken, Gosney, et al., 1984
Aitken, R.A.; Gosney, I.; Farries, H.; Palmer, M.H.; Simpson, I.; Cadogan, J.I.G.; Tinley, E.J.,
Chemical repercussions of orbital interactions through bond and through space. The reactivity of the double bond in unsaturated cyclic sulphones towards aziridine formation and epoxidation,
Tetrahedron, 1984, 40, 2487. [all data]