Propane, 2-(ethenyloxy)-
- Formula: C5H10O
- Molecular weight: 86.1323
- IUPAC Standard InChIKey: GNUGVECARVKIPH-UHFFFAOYSA-N
- CAS Registry Number: 926-65-8
- Chemical structure:
View 3d structure (requires JavaScript / HTML 5) - Other names: Ether, isopropyl vinyl; Isopropoxyethene; Isopropoxyethylene; Isopropyl vinyl ether; Vinyl isopropyl ether; 2-(Ethenyloxy)propane; CH2=CHOCH(CH3)2; 1-Isopropoxyethylene; 2-(vinyloxy)propane

Gas phase thermochemistry data

Data compiled by: Donald R. Burgess, Jr.
Quantity | Value | Units | Method | Reference | Comment |
---|---|---|---|---|---|
ΔfH°gas | -174.0 ± 2.2 | kJ/mol | N/A | Trofimov, Nedolya, et al., 1981 | Value computed using ΔfHliquid° value of -205±0.8 kj/mol from Trofimov, Nedolya, et al., 1981 and ΔvapH° value of 31±2 kj/mol from missing citation. |

Condensed phase thermochemistry data

Data compiled by: Hussein Y. Afeefy, Joel F. Liebman, and Stephen E. Stein
Quantity | Value | Units | Method | Reference | Comment |
---|---|---|---|---|---|
ΔfH°liquid | -205. ± 0.8 | kJ/mol | Ccb | Trofimov, Nedolya, et al., 1981 | |
Quantity | Value | Units | Method | Reference | Comment |
ΔcH°liquid | -3192. ± 0.8 | kJ/mol | Ccb | Trofimov, Nedolya, et al., 1981 | Corresponding ΔfHºliquid = -205. kJ/mol (simple calculation by NIST; no Washburn corrections) |
ΔcH°liquid | -3181. ± 8.8 | kJ/mol | Ccb | Favorskii and Shostakovskii, 1943 | Corresponding ΔfHºliquid = -215. kJ/mol (simple calculation by NIST; no Washburn corrections) |

Phase change data

Data compiled by: Hussein Y. Afeefy, Joel F. Liebman, and Stephen E. Stein
Quantity | Value | Units | Method | Reference | Comment |
---|---|---|---|---|---|
ΔvapH° | 31. ± 2. | kJ/mol | V | Trofimov, Nedolya, et al., 1981 |

Gas phase ion energetics data

Data compiled as indicated in comments:
LLK - Sharon G. Lias, Rhoda D. Levin, and Sherif A. Kafafi
Ionization energy determinations
IE (eV) | Method | Reference | Comment |
---|---|---|---|
8.90 | PE | Batich, Heilbronner, et al., 1976 | Vertical value; LLK |

References

Trofimov, Nedolya, et al., 1981
Trofimov, B.A.; Nedolya, N.A.; Lebedeva, N.D.; Ryadchenko, V.L.; Masalitionova, T.N.; Dobichin, S.L.; Zacheslavskaya, R.Kh.; Petrov, G.N.,
Thermochemical and quantochemical estimationof the conjungation energy of vinyl ethers.,
Izv. Akad. Nauk SSSR, Ser. Khim., 1981, 30, 752-753. [all data]
Favorskii and Shostakovskii, 1943
Favorskii, A.E.; Shostakovskii, M.F.,
Vinyl ethers. I. Synthesis and properties of vinyl ethers,
Zh. Obshch. Kim., 1943, 13, 1-20. [all data]
Batich, Heilbronner, et al., 1976
Batich, C.; Heilbronner, E.; Quinn, C.B.; Wiseman, J.R.,
The electronic structure of vinyl ethers and sulfides with interrupted conjugation examined by photoelectron spectroscopy,
Helv. Chim. Acta, 1976, 59, 512. [all data]