1-Penten-3-yne, 2-methyl-
- Formula: C6H8
- Molecular weight: 80.1277
- IUPAC Standard InChIKey: KGIABMDFILVKGN-UHFFFAOYSA-N
- CAS Registry Number: 926-55-6
- Chemical structure:
View 3d structure (requires JavaScript / HTML 5) - Other names: CH3C≡CC(CH3)=CH2; 2-Methyl-1-pentene-3-yne; 2-Methyl-1-penten-3-yne

Phase change data

Data compiled by: Robert L. Brown and Stephen E. Stein
Quantity | Value | Units | Method | Reference | Comment |
---|---|---|---|---|---|
Tboil | 355. to 356. | K | N/A | Farchan Laboratories, 1990 |

Gas phase ion energetics data

Data compiled as indicated in comments:
LLK - Sharon G. Lias, Rhoda D. Levin, and Sherif A. Kafafi
Ionization energy determinations
IE (eV) | Method | Reference | Comment |
---|---|---|---|
8.72 ± 0.01 | PE | Carlier, Mouvier, et al., 1979 | LLK |

References

Farchan Laboratories, 1990
Farchan Laboratories,
Research Chemicals Catalog, Farchan Laboratories, Gainesville, FL, 1990, 91. [all data]
Carlier, Mouvier, et al., 1979
Carlier, P.; Mouvier, G.; Mesnard, D.; Miginiac, L.,
Etude par spectrometrie de photoelectrons de la structure electronique des phenyl-alcynes conjugues,
J. Electron Spectrosc. Relat. Phenom., 1979, 16, 147. [all data]