1,3-Pentadiene, 2-methyl-, (E)-
- Formula: C6H10
- Molecular weight: 82.1436
- IUPAC Standard InChIKey: RCJMVGJKROQDCB-SNAWJCMRSA-N
- CAS Registry Number: 926-54-5
- Chemical structure:
View 3d structure (requires JavaScript / HTML 5) - Stereoisomers:
- Other names: (E)-CH2=C(CH3)CH=CHCH3; trans-2-Methyl-1,3-pentadiene; (E)-1,3-Pentadiene, 2-methyl-; 2-Methyl-1,trans-3-pentadiene; trans-2-methylpenta-1,3-diene

Phase change data

Data compiled as indicated in comments:
BS - Robert L. Brown and Stephen E. Stein
TRC - Thermodynamics Research Center, NIST Boulder Laboratories, Chris Muzny director
Quantity | Value | Units | Method | Reference | Comment |
---|---|---|---|---|---|
Tboil | 348.7 | K | N/A | Aldrich Chemical Company Inc., 1990 | BS |
Tboil | 348.85 | K | N/A | Anonymous, 1962 | Uncertainty assigned by TRC = 0.4 K; TRC |

Gas phase ion energetics data

Data compiled as indicated in comments:
LL - Sharon G. Lias and Joel F. Liebman
LLK - Sharon G. Lias, Rhoda D. Levin, and Sherif A. Kafafi
Ionization energy determinations
IE (eV) | Method | Reference | Comment |
---|---|---|---|
8.42 ± 0.025 | PE | Werstiuk and Timmins, 1988 | LL |
8.45 ± 0.05 | EI | Wolkoff, Holmes, et al., 1980 | LLK |
8.45 | EI | Lossing and Traeger, 1975 | LLK |
8.43 | PE | Masclet, Mouvier, et al., 1981 | Vertical value; LLK |
8.47 | PE | Worley, Webb, et al., 1979 | Vertical value; LLK |
Appearance energy determinations
Ion | AE (eV) | Other Products | Method | Reference | Comment |
---|---|---|---|---|---|
C5H7+ | 10.37 | CH3 | EI | Lossing and Traeger, 1975 | LLK |

Kovats' RI, non-polar column, isothermal

Column type | Active phase | Temperature (C) | I | Reference | Comment |
---|---|---|---|---|---|
Packed | Squalane | 70. | 627. | Safina, Poznyak, et al., 1989 | He, Risorb (0.2-0.3 mm); Column length: 2. m |
Capillary | Squalane | 50. | 627.7 | Bajus, Veselý, et al., 1979 | Column length: 100. m; Column diameter: 0.25 mm |
Capillary | Squalane | 70. | 627.3 | Bajus, Veselý, et al., 1979 | Column length: 100. m; Column diameter: 0.25 mm |

References

Aldrich Chemical Company Inc., 1990
Aldrich Chemical Company Inc.,
Catalog Handbook of Fine Chemicals, Aldrich Chemical Company, Inc., Milwaukee WI, 1990, 1. [all data]
Anonymous, 1962
Anonymous, R.,
, Am. Pet. Inst. Res. Proj. 58A, Annu. Rep., 1962. [all data]
Werstiuk and Timmins, 1988
Werstiuk, N.; Timmins, G.,
A redetermination of the ultraviolet photoelectron spectrum of (Z)-2-methyl-1,3-pentadiene; evidence that twisted conformers predominate in the gas phase,
Can. J. Chem., 1988, 66, 2954. [all data]
Wolkoff, Holmes, et al., 1980
Wolkoff, P.; Holmes, J.L.; Lossing, F.P.,
On the formation of cyclopentenium cations from all C6H10+ molecular ion structures,
Can. J. Chem., 1980, 58, 251. [all data]
Lossing and Traeger, 1975
Lossing, F.P.; Traeger, J.C.,
Stabilization in cyclopentadienyl, cyclopentenyl, and cyclopentyl cations,
J. Am. Chem. Soc., 1975, 97, 1579. [all data]
Masclet, Mouvier, et al., 1981
Masclet, P.; Mouvier, G.; Bocquet, J.F.,
Effets electroniques et effets steriques dus a la substitution alcoyle dans les dienes conjugues,
J. Chim. Phys., 1981, 78, 99. [all data]
Worley, Webb, et al., 1979
Worley, S.D.; Webb, T.R.; Gibson, D.H.; Ong, T.-S.,
On the electronic structures of cyclobutadiene trimethylenemethane,
J. Organomet. Chem., 1979, 168, 16. [all data]
Safina, Poznyak, et al., 1989
Safina, L.R.; Poznyak, T.I.; Lisitsyn, D.M.; Kiseleva, E.V.; Kovalev, G.I.,
Selective gas-chromatographic determination of trace unsaturated and aromatic-hydrocarbons in complex-mixtures,
J. Appl. Chem. USSR (Engl. Transl.), 1989, 44, 5, 749-754. [all data]
Bajus, Veselý, et al., 1979
Bajus, M.; Veselý, V.; Leclercq, P.A.; Rijks, J.A.,
Steam cracking of hydrocarbons. 2. Pyrolysis of methylcyclohexane,
Ind. Eng. Chem. Prod. Res. Dev., 1979, 18, 2, 135-142, https://doi.org/10.1021/i360070a012
. [all data]