Propanedinitrile, methylene-
- Formula: C4H2N2
- Molecular weight: 78.0721
- IUPAC Standard InChIKey: FCYVWWWTHPPJII-UHFFFAOYSA-N
- CAS Registry Number: 922-64-5
- Chemical structure:
View 3d structure (requires JavaScript / HTML 5) - Other names: Malononitrile, methylene-; Vinylidene cyanide; 1,1-Dicyanoethylene; 1,1-Ethenedicarbonitrile

Gas phase ion energetics data

Data compiled by: Sharon G. Lias, Rhoda D. Levin, and Sherif A. Kafafi
Ionization energy determinations
IE (eV) | Method | Reference | Comment |
---|---|---|---|
11.38 ± 0.05 | PE | Houk and Munchausen, 1976 | Vertical value |

References

Houk and Munchausen, 1976
Houk, K.N.; Munchausen, L.L.,
Ionization potentials, electron affinities, reactivities of cyanoalkenes related electron-deficient alkenes. A frontier molecular orbital treatment of cyanoalkene reactivities in cycloaddition, electrophilic, nucleophilic, and radical reactions.,
J. Am. Chem. Soc., 1976, 98, 937. [all data]