Naphthacene
- Formula: C18H12
- Molecular weight: 228.2879
- IUPAC Standard InChIKey: IFLREYGFSNHWGE-UHFFFAOYSA-N
- CAS Registry Number: 92-24-0
- Chemical structure:
View 3d structure (requires JavaScript / HTML 5) - Other names: Tetracene; Benz[b]anthracene; Chrysogen; Methacene; Rubene; Tetracen; 2,3-Benzanthrene; 2,3-Benzanthracene; Benzo[b]anthracene; Tetracene (hydrocarbon)

Gas phase ion energetics data

Data evaluated as indicated in comments:
HL - Edward P. Hunter and Sharon G. Lias
L - Sharon G. Lias
Data compiled as indicated in comments:
MM - Michael M. Meot-Ner (Mautner)
LBLHLM - Sharon G. Lias, John E. Bartmess, Joel F. Liebman, John L. Holmes, Rhoda D. Levin, and W. Gary Mallard
LLK - Sharon G. Lias, Rhoda D. Levin, and Sherif A. Kafafi
RDSH - Henry M. Rosenstock, Keith Draxl, Bruce W. Steiner, and John T. Herron
B - John E. Bartmess
Quantity | Value | Units | Method | Reference | Comment |
---|---|---|---|---|---|
IE (evaluated) | 6.97 ± 0.05 | eV | N/A | N/A | L |
Quantity | Value | Units | Method | Reference | Comment |
Proton affinity (review) | 905.5 | kJ/mol | N/A | Hunter and Lias, 1998 | HL |
Quantity | Value | Units | Method | Reference | Comment |
Gas basicity | 876.5 | kJ/mol | N/A | Hunter and Lias, 1998 | HL |
Electron affinity determinations
EA (eV) | Method | Reference | Comment |
---|---|---|---|
1.0580 ± 0.0050 | LPES | Mitsui, Ando, et al., 2007 | B |
1.067 ± 0.043 | IMRE | Crocker, Wang, et al., 1993 | ΔGea(458 K) = -23.9 kcal/mol; ΔSea (estimated) = -1.5 eu (anthracene, Chowdhury, Heinis, et al., 1986); B |
0.880 ± 0.040 | ECD | Lyons, Morris, et al., 1968 | B |
Proton affinity at 298K
Proton affinity (kJ/mol) | Reference | Comment |
---|---|---|
908.3 | Aue, Guidoni, et al., 2000 | Experimental literature data re-evaluated by the authors using ab initio protonation entropies; MM |
Gas basicity at 298K
Gas basicity (review) (kJ/mol) | Reference | Comment |
---|---|---|
884.1 | Aue, Guidoni, et al., 2000 | Experimental literature data re-evaluated by the authors using ab initio protonation entropies; MM |
Ionization energy determinations
IE (eV) | Method | Reference | Comment |
---|---|---|---|
6.97 | EI | Stahl and Maquin, 1984 | LBLHLM |
6.9 ± 0.3 | EI | Shushan and Boyd, 1980 | LLK |
6.97 | PE | Schmidt, 1977 | LLK |
7.04 | PE | Clar and Schmidt, 1975 | LLK |
7.04 ± 0.04 | PE | Boschi, Clar, et al., 1974 | LLK |
7.01 | PE | Clark, Brogli, et al., 1972 | LLK |
7.0 ± 0.3 | EI | Wacks, 1964 | RDSH |
6.94 | CTS | Kuroda, 1964 | RDSH |
6.95 | CTS | Briegleb, 1964 | RDSH |
6.9 | PI | Terenin, 1961 | RDSH |
7.00 | CTS | Birks and Stifkin, 1961 | RDSH |
7.0 | CTS | Briegleb and Czekalla, 1959 | RDSH |
6.64 | CTS | Matsen, 1956 | RDSH |
6.97 ± 0.02 | PE | Schmidt, 1977 | Vertical value; LLK |
7.01 | PE | Brogli and Heilbronner, 1972 | Vertical value; LLK |
Appearance energy determinations
Ion | AE (eV) | Other Products | Method | Reference | Comment |
---|---|---|---|---|---|
C16H10+ | 15.5 ± 0.5 | C2H2 | EI | Shushan and Boyd, 1980 | LLK |
C18H11+ | 14.5 ± 0.5 | H | EI | Shushan and Boyd, 1980 | LLK |

Gas phase thermochemistry data

Data compiled as indicated in comments:
DRB - Donald R. Burgess, Jr.
GT - Glushko Thermocenter, Russian Academy of Sciences, Moscow
Quantity | Value | Units | Method | Reference | Comment |
---|---|---|---|---|---|
ΔfH°gas | 81.9 ± 1.4 | kcal/mol | Review | Roux, Temprado, et al., 2008 | There are insufficient literature values to properly evaluated the data and measurements are of low quality and/or there is substantial disagreement with values predicted using thermochemical cycles or estimation methods (trends).; DRB |
Constant pressure heat capacity of gas
Cp,gas (cal/mol*K) | Temperature (K) | Reference | Comment |
---|---|---|---|
11.63 | 50. | Dorofeeva O.V., 1988 | Recommended values were calculated statistically mechanically using force field approximation for polycyclic aromatic hydrocarbons to estimate the needed vibrational frequencies (see also [ Dorofeeva O.V., 1986, Moiseeva N.F., 1989]). These functions are reproduced in the reference book [ Frenkel M., 1994].; GT |
18.24 | 100. | ||
26.346 | 150. | ||
35.712 | 200. | ||
50.631 | 273.15 | ||
55.77 ± 0.36 | 298.15 | ||
56.150 | 300. | ||
75.406 | 400. | ||
91.463 | 500. | ||
104.29 | 600. | ||
114.53 | 700. | ||
122.81 | 800. | ||
129.61 | 900. | ||
135.25 | 1000. | ||
139.99 | 1100. | ||
143.99 | 1200. | ||
147.39 | 1300. | ||
150.30 | 1400. | ||
152.80 | 1500. |

Condensed phase thermochemistry data

Data compiled as indicated in comments:
DRB - Donald R. Burgess, Jr.
ALS - Hussein Y. Afeefy, Joel F. Liebman, and Stephen E. Stein
DH - Eugene S. Domalski and Elizabeth D. Hearing
Quantity | Value | Units | Method | Reference | Comment |
---|---|---|---|---|---|
ΔfH°solid | 49.40 ± 0.72 | kcal/mol | Review | Roux, Temprado, et al., 2008 | There are insufficient literature values to properly evaluated the data and measurements are of low quality and/or there is substantial disagreement with values predicted using thermochemical cycles or estimation methods (trends).; DRB |
Quantity | Value | Units | Method | Reference | Comment |
ΔcH°solid | -2140.76 ± 0.32 | kcal/mol | Ccb | Magnus, Hartmann, et al., 1951 | Reanalyzed by Cox and Pilcher, 1970, Original value = -2140.86 ± 0.32 kcal/mol; Corresponding ΔfHºsolid = 37.95 kcal/mol (simple calculation by NIST; no Washburn corrections); ALS |
Quantity | Value | Units | Method | Reference | Comment |
S°solid,1 bar | 51.48 | cal/mol*K | N/A | Wong and Westrum, 1980 | DH |
Constant pressure heat capacity of solid
Cp,solid (cal/mol*K) | Temperature (K) | Reference | Comment |
---|---|---|---|
56.55 | 298.15 | Wong and Westrum, 1980 | T = 5 to 350 K.; DH |

Phase change data

Data compiled as indicated in comments:
TRC - Thermodynamics Research Center, NIST Boulder Laboratories, Chris Muzny director
AC - William E. Acree, Jr., James S. Chickos
DRB - Donald R. Burgess, Jr.
ALS - Hussein Y. Afeefy, Joel F. Liebman, and Stephen E. Stein
Quantity | Value | Units | Method | Reference | Comment |
---|---|---|---|---|---|
Tfus | 613.15 | K | N/A | Inokuchi, Shiba, et al., 1952 | Uncertainty assigned by TRC = 2. K; TRC |
Tfus | 613.15 | K | N/A | Inokuchi, 1951 | Uncertainty assigned by TRC = 2. K; TRC |
Quantity | Value | Units | Method | Reference | Comment |
ΔvapH° | 25.38 ± 0.88 | kcal/mol | CGC | Hanshaw, Nutt, et al., 2008 | AC |
Quantity | Value | Units | Method | Reference | Comment |
ΔsubH° | 32.48 (+0.1,-0.02) | kcal/mol | Review | Roux, Temprado, et al., 2008 | There are insufficient literature values to properly evaluate the data and insufficient information to construct thermochemical cycles or estimate values for comparison, and one must rely solely upon reported uncertainities and the quality of the measurements. In general, the evaluated uncertainty limits are on the order of (3 to 9) kJ/mol.; DRB |
ΔsubH° | 34. ± 1. | kcal/mol | V | Kruif, 1980 | ALS |
ΔsubH° | 34.3 ± 0.1 | kcal/mol | TE,M | Kruif, 1980 | Based on data from 419. to 446. K.; AC |
ΔsubH° | 29.8 | kcal/mol | V | Wakayama and Inokuchi, 1967 | ALS |
Enthalpy of sublimation
ΔsubH (kcal/mol) | Temperature (K) | Method | Reference | Comment |
---|---|---|---|---|
29.83 ± 0.62 | 399. to 430. | ME | Oja, Chen, et al., 2009 | AC |
30.1 ± 2.2 | 429. | ME | Oja and Suuberg, 1998 | Based on data from 386. to 472. K.; AC |
30.23 | 383. | GS | Nass, Lenoir, et al., 1995 | Based on data from 313. to 453. K.; AC |
29.8 ± 1. | 422. | ME | Wakayama and Inokuchi, 1967, 2 | See also Pedley and Rylance, 1977.; AC |
30.78 | 473. | HSA | Morris, 1965 | Based on data from 433. to 493. K.; AC |
31.69 | 468. | HSA | Fielding and MacKay, 1964 | Based on data from 433. to 483. K.; AC |
28.01 | 459. | ME | Inokuchi, Shiba, et al., 1952 | See also Jones, 1960.; AC |
29.7 | 293. | V | Magnus, Hartmann, et al., 1951 | ALS |

Van Den Dool and Kratz RI, non-polar column, custom temperature program

Data compiled by: NIST Mass Spectrometry Data Center, William E. Wallace, director

Column type CapillaryCapillary
Active phase Methyl SiliconeMethyl Silicone
Column length (m)
Carrier gas
Substrate
Column diameter (mm)
Phase thickness (μm)
Program 50C (2min) => 20C/min => 160C => 5C/min => 210C => 10C/min => 300C50C (2min) => 20C/min => 160C => 5C/min => 210C => 10C/min => 300C
I 2395.2425.
ReferenceOda, Ichikawa, et al., 1996Oda, Ichikawa, et al., 1996
Comment MSDC-RI MSDC-RI

References

Hunter and Lias, 1998
Hunter, E.P.; Lias, S.G.,
Evaluated Gas Phase Basicities and Proton Affinities of Molecules: An Update,
J. Phys. Chem. Ref. Data, 1998, 27, 3, 413-656, https://doi.org/10.1063/1.556018
. [all data]
Mitsui, Ando, et al., 2007
Mitsui, M.; Ando, N.; Nakajima, A.,
Mass spectrometry and photoelectron spectroscopy of tetracene cluster anions, (Tetracene)(n)(-) (n=1-100): Evidence for the highly localized nature of polarization in a cluster analogue of o,
J. Phys. Chem. A, 2007, 111, 39, 9644-9648, https://doi.org/10.1021/jp076134h
. [all data]
Crocker, Wang, et al., 1993
Crocker, L.; Wang, T.B.; Kebarle, P.,
Electron Affinities of Some Polycyclic Aromatic Hydrocarbons, Obtained from Electron-Transfer Equilibria,
J. Am. Chem. Soc., 1993, 115, 17, 7818, https://doi.org/10.1021/ja00070a030
. [all data]
Chowdhury, Heinis, et al., 1986
Chowdhury, S.; Heinis, T.; Grimsrud, E.P.; Kebarle, P.,
Entropy Changes and Electron Affinities from Gas-Phase Electron Transfer Equilibria: A- + B = A + B-,
J. Phys. Chem., 1986, 90, 12, 2747, https://doi.org/10.1021/j100403a037
. [all data]
Lyons, Morris, et al., 1968
Lyons, L.E.; Morris, G.C.; Warren, L.J.,
Electron Affinities and the Electron Capture Method for Aromatic Hydrocarbons,
J. Phys. Chem., 1968, 72, 10, 3677, https://doi.org/10.1021/j100856a056
. [all data]
Aue, Guidoni, et al., 2000
Aue, D.H.; Guidoni, M.; Betowski, L.D.,
Ab initio calculated gas-phase basicities of polynuclear aromatic hydrocarbons,
Int. J. Mass Spectrom., 2000, 201, 283. [all data]
Stahl and Maquin, 1984
Stahl, D.; Maquin, F.,
Charge-stripping mass spectrometry of molecular ions from polyacenes and molecular orbital theory,
Chem. Phys. Lett., 1984, 108, 613. [all data]
Shushan and Boyd, 1980
Shushan, B.; Boyd, R.K.,
Unimolecular and collision induced fragmentations of molecular ions of polycyclic aromatic hydrocarbons,
Org. Mass Spectrom., 1980, 15, 445. [all data]
Schmidt, 1977
Schmidt, W.,
Photoelectron spectra of polynuclear aromatics. V. Correlations with ultraviolet absorption spectra in the catacondensed series,
J. Chem. Phys., 1977, 66, 828. [all data]
Clar and Schmidt, 1975
Clar, E.; Schmidt, W.,
Correlations btween photoelectron and ultraviolet absorption spectra of polycyclic hydrocarbons and the number of aromatic sextets,
Tetrahedron, 1975, 31, 2263. [all data]
Boschi, Clar, et al., 1974
Boschi, R.; Clar, E.; Schmidt, W.,
Photoelectron spectra of polynuclear aromatics. III. The effect of nonplanarity in sterically overcrowded aromatic hydrocarbons,
J. Chem. Phys., 1974, 60, 4406. [all data]
Clark, Brogli, et al., 1972
Clark, P.A.; Brogli, F.; Heilbronner, E.,
The π-orbital energies of the acenes,
Helv. Chim. Acta, 1972, 55, 1415. [all data]
Wacks, 1964
Wacks, M.E.,
Electron-impact studies of aromatic hydrocarbons. II. Naphthacene, naphthaphene, chrysene, triphenylene, and pyrene,
J. Chem. Phys., 1964, 41, 1661. [all data]
Kuroda, 1964
Kuroda, H.,
Ionization potentials of polycyclic aromatic hydrocarbons,
Nature, 1964, 201, 1214. [all data]
Briegleb, 1964
Briegleb, G.,
Electron affinity of organic molecules,
Angew. Chem. Intern. Ed., 1964, 3, 617. [all data]
Terenin, 1961
Terenin, A.,
Charge transfer in organic solids, induced by light,
Proc. Chem. Soc., London, 1961, 321. [all data]
Birks and Stifkin, 1961
Birks, J.B.; Stifkin, M.A.,
π-Electronic excitation and ionization energies of condensed ring aromatic hydrocarbons,
Nature, 1961, 191, 761. [all data]
Briegleb and Czekalla, 1959
Briegleb, G.; Czekalla, J.,
Die Bestimmung von lonisierungsenergien aus den Spektren von Elektronenubergangskomplexen,
Z.Elektrochem., 1959, 63, 6. [all data]
Matsen, 1956
Matsen, F.A.,
Electron affinities, methyl affinities, and ionization energies of condensed ring aromatic hydrocarbons,
J. Chem. Phys., 1956, 24, 602. [all data]
Brogli and Heilbronner, 1972
Brogli, F.; Heilbronner, E.,
The photoelectron spectra of benzenoid hydrocarbons C18H12,
Angew. Chem. Int. Ed. Engl., 1972, 11, 538. [all data]