2-Propanone, 1-chloro-1,1,3,3-tetrafluoro-
- Formula: C3HClF4O
- Molecular weight: 164.486
- IUPAC Standard InChIKey: VANKMKYWHUAISZ-UHFFFAOYSA-N
- CAS Registry Number: 920-64-9
- Chemical structure:
View 3d structure (requires JavaScript / HTML 5) - Permanent link for this species. Use this link for bookmarking this species for future reference.

Gas phase ion energetics data

Data compiled by: Sharon G. Lias, Rhoda D. Levin, and Sherif A. Kafafi
Ionization energy determinations
IE (eV) | Method | Reference | Comment |
---|---|---|---|
11.33 ± 0.02 | PE | Young and Cheng, 1976 | Vertical value |

References

Young and Cheng, 1976
Young, V.Y.; Cheng, K.L.,
The photoelectron spectra of halogen substituted acetones,
J. Chem. Phys., 1976, 65, 3187. [all data]