Benzenamine, N,N-diethyl-3-methyl-
- Formula: C11H17N
- Molecular weight: 163.2594
- IUPAC Standard InChIKey: CIPVVROJHKLHJI-UHFFFAOYSA-N
- CAS Registry Number: 91-67-8
- Chemical structure:
View 3d structure (requires JavaScript / HTML 5) - Other names: m-Toluidine, N,N-diethyl-; m-Methyl(diethylamino)benzene; m-Methyl-N,N-diethylaniline; N,N-Diethyl-m-toluidine; N,N-Diethyl-3-methylaniline; 3-(Diethylamino)-1-methylbenzene; 3-(Diethylamino)toluene; 3-(N,N-Diethylamino)toluene; 3-Methyl-N,N-diethylbenzenamine; 1-(Diethylamino)-3-methylbenzene; NSC 96629

Gas phase ion energetics data

Data evaluated as indicated in comments:
HL - Edward P. Hunter and Sharon G. Lias
Data compiled as indicated in comments:
LBLHLM - Sharon G. Lias, John E. Bartmess, Joel F. Liebman, John L. Holmes, Rhoda D. Levin, and W. Gary Mallard
Quantity | Value | Units | Method | Reference | Comment |
---|---|---|---|---|---|
Proton affinity (review) | 964.1 | kJ/mol | N/A | Hunter and Lias, 1998 | HL |
Quantity | Value | Units | Method | Reference | Comment |
Gas basicity | 932.2 | kJ/mol | N/A | Hunter and Lias, 1998 | HL |
Ionization energy determinations
IE (eV) | Method | Reference | Comment |
---|---|---|---|
6.90 | EQ | Lias, Jackson, et al., 1985 | LBLHLM |

Van Den Dool and Kratz RI, non-polar column, temperature ramp

Column type | Active phase | I | Reference | Comment |
---|---|---|---|---|
Capillary | OV-1 | 1290.1 | Gautzsch and Zinn, 1996 | 8. K/min; Tstart: 35. C; Tend: 300. C |

References

Hunter and Lias, 1998
Hunter, E.P.; Lias, S.G.,
Evaluated Gas Phase Basicities and Proton Affinities of Molecules: An Update,
J. Phys. Chem. Ref. Data, 1998, 27, 3, 413-656, https://doi.org/10.1063/1.556018
. [all data]
Lias, Jackson, et al., 1985
Lias, S.G.; Jackson, J.-A.A.; Argentar, H.; Liebman, J.F.,
Substituted N,N-dialkylanilines: Relative ionization energies and proton affinities through determinations of ion-molecule reaction equilibrium constants,
J. Org. Chem., 1985, 50, 333. [all data]
Gautzsch and Zinn, 1996
Gautzsch, R.; Zinn, P.,
Use of incremental models to estimate the retention indexes of aromatic compounds,
Chromatographia, 1996, 43, 3/4, 163-176, https://doi.org/10.1007/BF02292946
. [all data]