Coumarin
- Formula: C9H6O2
- Molecular weight: 146.1427
- IUPAC Standard InChIKey: ZYGHJZDHTFUPRJ-UHFFFAOYSA-N
- CAS Registry Number: 91-64-5
- Chemical structure:
View 3d structure (requires JavaScript / HTML 5) - Isotopologues:
- Other names: 2H-1-Benzopyran-2-one; cis-o-Coumarinic acid lactone; o-Hydroxycinnamic acid lactone; Benzo-α-pyrone; Coumarinic anhydride; Rattex; Tonka bean camphor; 1,2-Benzopyrone; 2-Propenoic acid, 3-(2-hydroxyphenyl)-, δ-lactone; 2H-Benzo[b]pyran-2-one; o-Hydroxycinnamic lactone; Cinnamic acid, o-hydroxy-, δ-lactone; Cumarin; 2-Oxo-1,2-benzopyran; 2H-1-Benzopyran, 2-oxo-; o-Hydroxyzimtsaure-lacton; Kumarin; NCI C07103; NSC 8774; 2H-Chromen-2-one

Gas phase thermochemistry data

Data compiled by: Hussein Y. Afeefy, Joel F. Liebman, and Stephen E. Stein
Quantity | Value | Units | Method | Reference | Comment |
---|---|---|---|---|---|
ΔfH°gas | -42.26 ± 0.43 | kcal/mol | Ccr | Watik and Sabbah, 1991 |

Condensed phase thermochemistry data

Data compiled by: Hussein Y. Afeefy, Joel F. Liebman, and Stephen E. Stein
Quantity | Value | Units | Method | Reference | Comment |
---|---|---|---|---|---|
ΔfH°solid | -62.12 ± 0.43 | kcal/mol | Ccr | Watik and Sabbah, 1991 | |
Quantity | Value | Units | Method | Reference | Comment |
ΔcH°solid | -989.29 ± 0.41 | kcal/mol | Ccr | Watik and Sabbah, 1991 | Corresponding ΔfHºsolid = -62.12 kcal/mol (simple calculation by NIST; no Washburn corrections) |

Phase change data

Data compiled as indicated in comments:
BS - Robert L. Brown and Stephen E. Stein
TRC - Thermodynamics Research Center, NIST Boulder Laboratories, Chris Muzny director
AC - William E. Acree, Jr., James S. Chickos
ALS - Hussein Y. Afeefy, Joel F. Liebman, and Stephen E. Stein
DRB - Donald R. Burgess, Jr.
DH - Eugene S. Domalski and Elizabeth D. Hearing
Quantity | Value | Units | Method | Reference | Comment |
---|---|---|---|---|---|
Tboil | 571.2 | K | N/A | Aldrich Chemical Company Inc., 1990 | BS |
Tboil | 564. | K | N/A | Buckingham and Donaghy, 1982 | BS |
Quantity | Value | Units | Method | Reference | Comment |
Tfus | 343. | K | N/A | Buckingham and Donaghy, 1982 | BS |
Tfus | 343.05 | K | N/A | Serpinskii, Voitkevich, et al., 1958 | Uncertainty assigned by TRC = 1.5 K; TRC |
Tfus | 340. | K | N/A | Sorum and Durand, 1952 | Uncertainty assigned by TRC = 1.5 K; TRC |
Quantity | Value | Units | Method | Reference | Comment |
ΔsubH° | 22.8 ± 0.62 | kcal/mol | C | Matos, Sousa, et al., 2009 | AC |
ΔsubH° | 19.9 | kcal/mol | C | El Watik and Sabbah, 1991 | See also Sabbah and Watik, 1992.; AC |
ΔsubH° | 19.86 ± 0.053 | kcal/mol | C | Watik and Sabbah, 1991 | ALS |
ΔsubH° | 19.9 | kcal/mol | N/A | Watik and Sabbah, 1991 | DRB |
Enthalpy of vaporization
ΔvapH (kcal/mol) | Temperature (K) | Method | Reference | Comment |
---|---|---|---|---|
15.1 | 394. | A | Stephenson and Malanowski, 1987 | Based on data from 379. to 463. K. See also Stull, 1947.; AC |
Antoine Equation Parameters
log10(P) = A − (B / (T + C))
P = vapor pressure (atm)
T = temperature (K)
View plot Requires a JavaScript / HTML 5 canvas capable browser.
Temperature (K) | A | B | C | Reference | Comment |
---|---|---|---|---|---|
379. to 564. | 5.30958 | 2797.239 | -37.541 | Stull, 1947 | Coefficents calculated by NIST from author's data. |
Enthalpy of sublimation
ΔsubH (kcal/mol) | Temperature (K) | Method | Reference | Comment |
---|---|---|---|---|
19.859 | 298.15 | N/A | Sabbah and El Watik, 1992 | DH |
20.6 | 323. | ME | Serpinskii, Voitkevich, et al., 1953 | Based on data from 293. to 353. K. See also Jones, 1960 and Stephenson and Malanowski, 1987.; AC |
Enthalpy of fusion
ΔfusH (kcal/mol) | Temperature (K) | Method | Reference | Comment |
---|---|---|---|---|
4.5746 | 342.14 | N/A | Sabbah and El Watik, 1992 | DH |
4.5746 | 342.14 | N/A | El Watik and Sabbah, 1991, 2 | DH |
4.453 | 342.3 | DSC | Matos, Sousa, et al., 2009 | AC |
4.575 | 342.1 | N/A | Domalski and Hearing, 1996 | AC |

Gas phase ion energetics data

Data compiled as indicated in comments:
LL - Sharon G. Lias and Joel F. Liebman
LLK - Sharon G. Lias, Rhoda D. Levin, and Sherif A. Kafafi
RDSH - Henry M. Rosenstock, Keith Draxl, Bruce W. Steiner, and John T. Herron
Ionization energy determinations
IE (eV) | Method | Reference | Comment |
---|---|---|---|
8.72 | PE | Redchenko, Safronov, et al., 1992 | Vertical value; LL |
Appearance energy determinations
Ion | AE (eV) | Other Products | Method | Reference | Comment |
---|---|---|---|---|---|
C7H6+ | 13.68 | 2C0 | EI | Occolowitz and White, 1968 | RDSH |
C8H6O+ | 10.8 | CO | EI | Tang, McGowan, et al., 1979 | LLK |
C8H6O+ | 11.1 | CO | EI | Barnes and Occolowitz, 1964 | RDSH |

Kovats' RI, non-polar column, isothermal

View large format table.

Column type Active phase Temperature (C) I Reference Comment
CapillaryLM-1170.1434.Soares, Monache, et al., 199925. m/0.25 mm/0.25 μm, H2
CapillaryLM-1190.1458.Soares, Monache, et al., 199925. m/0.25 mm/0.25 μm, H2
CapillarySE-30100.1404.9Tudor, 199740. m/0.35 mm/0.35 μm

Kovats' RI, non-polar column, temperature ramp

View large format table.

Column type Active phase I Reference Comment
CapillaryDB-11391.Velasco-Negueruela, Sanz, et al., 200450. m/0.25 mm/0.25 μm, N2, 4. K/min; Tstart: 95. C; Tend: 240. C

Van Den Dool and Kratz RI, non-polar column, temperature ramp

View large format table.

Column type Active phase I Reference Comment
CapillaryHP-5MS1432.Benkaci-Ali, Baaliouamer, et al., 200730. m/0.25 mm/0.25 μm, He, 60. C @ 8. min, 2. K/min, 250. C @ 30. min
CapillarySLB-5MS1441.Mondello, Sciarrone, et al., 200710. m/0.1 mm/0.1 μm, 40. K/min; Tstart: 40. C; Tend: 250. C
CapillarySLB-5MS1445.Mondello, Sciarrone, et al., 200710. m/0.1 mm/0.1 μm, 40. K/min; Tstart: 40. C; Tend: 250. C
CapillaryDB-51432.Dallüge, van Stee, et al., 200230. m/0.25 mm/1. μm, He, 2.5 K/min; Tstart: 50. C; Tend: 200. C
CapillaryDB-51456.Zhou, Wintersteen, et al., 200215. m/0.32 mm/0.5 μm, 30. C @ 2. min, 10. K/min, 225. C @ 20. min

Van Den Dool and Kratz RI, non-polar column, custom temperature program

View large format table.

Column type Active phase I Reference Comment
CapillaryHP-5MS1458.5Andriamaharavo, 201430. m/0.25 mm/0.25 μm, He; Program: 60C (1 min) => 5 C/min => 210C => 10 C/min => 280C (15 min)
CapillarySLB-5MS1438.Mondello, Sciarrone, et al., 200730. m/0.25 mm/0.25 μm; Program: not specified
CapillaryBPX-51457.Mondello, Casilli, et al., 200530. m/0.25 mm/0.25 μm, He; Program: 50C => 1.5C/min => 230C => 15C/min => 260C
CapillaryHP-11414.Sing, Smadja, et al., 199250. m/0.32 mm/1.05 μm, He; Program: 20C(0.5min) => 60C => 4C/min => 250C

Van Den Dool and Kratz RI, polar column, temperature ramp

View large format table.

Column type Active phase I Reference Comment
CapillaryDB-FFAP2428.Zhou, Wintersteen, et al., 200215. m/0.32 mm/0.25 μm, 30. C @ 2. min, 10. K/min, 225. C @ 20. min
CapillarySupelcowax-102450.Chung, 200060. m/0.25 mm/0.25 μm, He, 2. K/min, 195. C @ 90. min; Tstart: 35. C
CapillaryDB-Wax2451.Shimoda, Shigematsu, et al., 199560. m/0.25 mm/0.25 μm, 2. K/min; Tstart: 50. C; Tend: 230. C
CapillaryDB-Wax2451.Shimoda, Shigematsu, et al., 1995, 260. m/0.25 mm/0.25 μm, He, 2. K/min; Tstart: 50. C; Tend: 230. C

Normal alkane RI, non-polar column, temperature ramp

View large format table.

Column type Active phase I Reference Comment
CapillaryBPX-51471.Bieri and Marriott, 200830. m/0.25 mm/0.25 μm, Hydrogen, 3. K/min; Tstart: 100. C; Tend: 999. C
CapillaryBPX-51465.Bieri and Marriott, 200830. m/0.25 mm/0.25 μm, Hydrogen, 3. K/min; Tstart: 60. C; Tend: 999. C
CapillaryBPX-51465.Bieri and Marriott, 200830. m/0.25 mm/0.25 μm, Hydrogen, 3. K/min; Tstart: 60. C; Tend: 999. C
CapillaryBPX-51466.Bieri and Marriott, 200830. m/0.25 mm/0.25 μm, Hydrogen, 3. K/min; Tstart: 60. C; Tend: 999. C
CapillaryBPX-51467.Bieri and Marriott, 200830. m/0.25 mm/0.25 μm, Hydrogen, 3. K/min; Tstart: 60. C; Tend: 999. C
CapillaryBPX-51475.Bieri and Marriott, 200830. m/0.25 mm/0.25 μm, Hydrogen, 5. K/min; Tstart: 60. C; Tend: 999. C
CapillaryUltra 21431.Byun and Shin, 200850. m/0.20 mm/0.11 μm, Helium, 60. C @ 5. min, 2. K/min, 230. C @ 30. min
CapillaryEquity-5 MS1438.Mondello, Casilli, et al., 200830. m/0.25 mm/0.25 μm, Helium, 1.5 K/min; Tstart: 40. C; Tend: 260. C
CapillaryDB-51429.Orlita, Sidwa-Gorycka, et al., 2008Argon, 0.9 K/min; Tstart: 80. C; Tend: 200. C
CapillaryDB-51440.Zeller and Rychlik, 200725. m/0.32 mm/0.25 μm, He, 40. C @ 1. min, 6. K/min; Tend: 230. C
CapillaryDB-51432.Mirza, Navaei, et al., 200630. m/0.25 mm/0.25 μm, Helium, 50. C @ 5. min, 3. K/min; Tend: 250. C
CapillaryUltra-21456.Schlumpberger B.O., Clery R.A., et al., 200650. m/0.25 mm/0.32 μm, He, 2. K/min; Tstart: 50. C; Tend: 270. C
CapillaryDB-51424.Tellez, Khan, et al., 200430. m/0.25 mm/0.25 μm, He, 3. K/min; Tstart: 60. C; Tend: 240. C
CapillaryDB-51428.Tellez, Canel, et al., 199930. m/0.25 mm/0.25 μm, He, 3. K/min; Tstart: 60. C; Tend: 240. C
CapillaryOV-1011418.Egolf and Jurs, 19932. K/min; Column length: 50. m; Column diameter: 0.22 mm; Tstart: 80. C; Tend: 200. C

Normal alkane RI, non-polar column, custom temperature program

View large format table.

Column type Active phase I Reference Comment
CapillaryHP-51439.Maggi, Bilek, et al., 200925. m/0.32 mm/0.17 μm, Helium; Program: 60 0C (5 min) 4 0C/min -> 220 0C 11 0C/min -> 280 0C
CapillaryDB-5 MS1406.Zhu, Li, et al., 200830. m/0.25 mm/0.25 μm, Helium; Program: 50 0C (2.8 min) 5.5 0C/min -> 140 0C (1 min) 4.5 oC/min -> 220 0C -> 225 0C (2 min) 3.4 0C/min -> 265 0C (5 min)
CapillaryDB-5 MS1432.Zhu, Li, et al., 200830. m/0.25 mm/0.25 μm, Helium; Program: 50 0C (2.8 min) 5.5 0C/min -> 140 0C (1 min) 4.5 oC/min -> 220 0C -> 225 0C (2 min) 3.4 0C/min -> 265 0C (5 min)
CapillaryDB-5MS1443.Polzin, Stanfill, et al., 2007Column length: 30. m; Program: not specified
CapillarySE-301418.Vinogradov, 2004Program: not specified
CapillaryCP Sil 5 CB1397.Guyot-Declerck, Renson, et al., 200250. m/0.32 mm/1.2 μm, He; Program: 36C => 20C/min => 85C => 1C/min => 145C => 3C/min => 250C
CapillaryCP Sil 5 CB1392.Guyot, Bouseta, et al., 199850. m/0.32 mm/1.2 μm, He; Program: 30C => 55C/min => 85C => 1C/min => 145C => 3C/min => 250C
CapillaryMethyl Silicone1389.Grundschober, 1991Program: not specified
CapillaryOV-1011418.Shibamoto, 1987Program: not specified

Normal alkane RI, polar column, temperature ramp

View large format table.

Column type Active phase I Reference Comment
CapillaryDB-Wax2456.Kumazawa, Sakai, et al., 201030. m/0.25 mm/0.25 μm, Helium, 3. K/min; Tstart: 40. C; Tend: 210. C
CapillaryHP-Innowax2437.Soria, Sanz, et al., 200850. m/0.20 mm/0.20 μm, Helium, 45. C @ 2. min, 4. K/min, 190. C @ 50. min
CapillaryDB-FFAP2450.Zeller and Rychlik, 200730. m/0.32 mm/0.25 μm, He, 40. C @ 1. min, 6. K/min; Tend: 230. C
CapillaryDB-Wax2458.Kumazawa and Masuda, 200230. m/0.25 mm/0.25 μm, He, 5. K/min; Tstart: 40. C; Tend: 210. C
CapillaryDB-Wax2463.Kumazawa and Masuda, 200260. m/0.25 mm/0.25 μm, He, 5. K/min; Tstart: 40. C; Tend: 210. C
CapillaryDB-Wax2467.Kumazawa and Masuda, 199930. m/0.53 mm/1. μm, 5. K/min; Tstart: 40. C; Tend: 210. C
CapillaryDB-Wax2467.Kumazawa and Masuda, 199960. m/0.25 mm/0.25 μm, 5. K/min; Tstart: 40. C; Tend: 210. C
CapillaryCarbowax 20M2460.Buttery, Parker, et al., 198150. C @ 30. min, 1. K/min; Column length: 150. m; Column diameter: 0.64 mm; Tend: 170. C

Normal alkane RI, polar column, custom temperature program

View large format table.

Column type Active phase I Reference Comment
CapillaryPolyethylene Glycol2425.Grundschober, 1991Program: not specified

Lee's RI, non-polar column, temperature ramp

View large format table.

Column type Active phase I Reference Comment
CapillarySPB-5246.2Knobloch and Engewald, 199340. C @ 2. min, 4. K/min; Column length: 30. m; Column diameter: 0.25 mm; Tend: 300. C

References

Watik and Sabbah, 1991
Watik, L.E.; Sabbah, R.,
Etude thermodynamique de la coumarine et de l'anthrone,
Bull. Soc. Chim. Fr., 1991, 128, 344-349. [all data]
Aldrich Chemical Company Inc., 1990
Aldrich Chemical Company Inc.,
Catalog Handbook of Fine Chemicals, Aldrich Chemical Company, Inc., Milwaukee WI, 1990, 1. [all data]
Buckingham and Donaghy, 1982
Buckingham, J.; Donaghy, S.M.,
Dictionary of Organic Compounds: Fifth Edition, Chapman and Hall, New York, 1982, 1. [all data]
Serpinskii, Voitkevich, et al., 1958
Serpinskii, V.V.; Voitkevich, S.A.; Lyuboshits, N.Yu.,
Trudy Vsesoyuz. Nauch.-Issledovatel. Inst. Sintet. I. Natural. Dushistykh Veshchestv, 1958, 4, 125. [all data]
Sorum and Durand, 1952
Sorum, C.H.; Durand, E.A.,
The Melting of Binary Eutectics,
J. Am. Chem. Soc., 1952, 74, 1071. [all data]
Matos, Sousa, et al., 2009
Matos, M. Agostinha R.; Sousa, Clara C.S.; Miranda, Margarida S.; Morais, Victor M.F.; Liebman, Joel F.,
Energetics of Coumarin and Chromone,
J. Phys. Chem. B, 2009, 113, 32, 11216-11221, https://doi.org/10.1021/jp9026942
. [all data]
El Watik and Sabbah, 1991
El Watik, L.; Sabbah, R.,
Thermodynamic study of coumarin and anthrone,
Bull. Soc. Chim. Fr., 1991, 344. [all data]
Sabbah and Watik, 1992
Sabbah, R.; Watik, L. El,
Thermodynamic study of anthrone, coumarin and phenazine,
Journal of Thermal Analysis, 1992, 38, 4, 803-809, https://doi.org/10.1007/BF01979412
. [all data]
Stephenson and Malanowski, 1987
Stephenson, Richard M.; Malanowski, Stanislaw,
Handbook of the Thermodynamics of Organic Compounds, 1987, https://doi.org/10.1007/978-94-009-3173-2
. [all data]
Stull, 1947
Stull, Daniel R.,
Vapor Pressure of Pure Substances. Organic and Inorganic Compounds,
Ind. Eng. Chem., 1947, 39, 4, 517-540, https://doi.org/10.1021/ie50448a022
. [all data]
Sabbah and El Watik, 1992
Sabbah, R.; El Watik, L.,
Thermodynamic study of anthrone, counmarin and phenazine,
J. Therm. Anal., 1992, 38, 803-809. [all data]
Serpinskii, Voitkevich, et al., 1953
Serpinskii, V.V.; Voitkevich, S.A.; Lyuboshits, N.Y.,
Zh. Fiz. Khim., 1953, 27, 1032. [all data]
Jones, 1960
Jones, A.H.,
Sublimation Pressure Data for Organic Compounds.,
J. Chem. Eng. Data, 1960, 5, 2, 196-200, https://doi.org/10.1021/je60006a019
. [all data]
El Watik and Sabbah, 1991, 2
El Watik, L.; Sabbah, R.,
Thermodynamic study of coumarin and anthrone,
Bull. Soc. Chim. France, 1991, 128, 344-349. [all data]
Domalski and Hearing, 1996
Domalski, Eugene S.; Hearing, Elizabeth D.,
Heat Capacities and Entropies of Organic Compounds in the Condensed Phase. Volume III,
J. Phys. Chem. Ref. Data, 1996, 25, 1, 1, https://doi.org/10.1063/1.555985
. [all data]
Redchenko, Safronov, et al., 1992
Redchenko, V.V.; Safronov, A.I.; Kirpichenok, M.A.; Grandberg, I.I.; Traven', V.F.,
Electronic structure of π-systems. XV. Photoelectron spectra of 7-aminocoumarin derivatives,
J. Gen. Chem. USSR, 1992, 62, 2313. [all data]
Occolowitz and White, 1968
Occolowitz, J.L.; White, G.L.,
Energetic considerations in the assignment of some fragment ion structures,
Australian J. Chem., 1968, 21, 997. [all data]
Tang, McGowan, et al., 1979
Tang, S.-Y.; McGowan, J.C.; Singh, M.; Galatsis, P.; Ellis, B.E.; Boyd, R.K.; Brown, S.A.,
Mass spectrometry of some furanocoumarins,
Can. J. Chem., 1979, 57, 1995. [all data]
Barnes and Occolowitz, 1964
Barnes, C.S.; Occolowitz, J.L.,
The mass spectra of some naturally occurring oxygen heterocycles and related compounds,
Australian J. Chem., 1964, 17, 975. [all data]
Ikawa and Link., 1950
Ikawa, M.; Link., K.P.,
J. Am. Chem. Soc., 1950, 72, 4373. [all data]