2-Naphthalenamine
- Formula: C10H9N
- Molecular weight: 143.1852
- IUPAC Standard InChIKey: JBIJLHTVPXGSAM-UHFFFAOYSA-N
- CAS Registry Number: 91-59-8
- Chemical structure:
View 3d structure (requires JavaScript / HTML 5) - Other names: 2-Naphthylamine; β-Naphthylamine; C.I. 37270; Fast Scarlet Base B; 2-Aminonaphthalene; 2-Aminonaftalen; β-naftyloamina; β-Naftalamin; β-Naftilamina; 2-Naftylamin; 2-Naftylamine; 2-Naphthalamine; β-Naftylamin; β-Naphthylamin; 2-Naphthylamin; 6-Naphthylamine; RCRA waste number U168; UN 1650; USAF CB-22

Condensed phase thermochemistry data

Data compiled as indicated in comments:
ALS - Hussein Y. Afeefy, Joel F. Liebman, and Stephen E. Stein
DH - Eugene S. Domalski and Elizabeth D. Hearing
Quantity | Value | Units | Method | Reference | Comment |
---|---|---|---|---|---|
ΔfH°solid | 79.9 | kJ/mol | Ccb | Pushin, 1954 | Author's hf298_condensed=16.6 kcal/mol; ALS |
ΔfH°solid | 77.8 | kJ/mol | Ccb | Schmidt and Becker, 1933 | ALS |
ΔfH°solid | 81.6 | kJ/mol | Ccb | Lemoult, 1907 | ALS |
Quantity | Value | Units | Method | Reference | Comment |
ΔcH°solid | -5301. | kJ/mol | Ccb | Pushin, 1954 | Author's hf298_condensed=16.6 kcal/mol; ALS |
ΔcH°solid | -5279.0 ± 4.6 | kJ/mol | Ccb | Willis, 1947 | Reanalyzed by Cox and Pilcher, 1970, Original value = -5273.5 ± 4.6 kJ/mol; ALS |
ΔcH°solid | -5304.1 | kJ/mol | Ccb | Schmidt and Becker, 1933 | ALS |
ΔcH°solid | -5284.0 ± 5.4 | kJ/mol | Ccb | Milone and Rossignoli, 1932 | Reanalyzed by Cox and Pilcher, 1970, Original value = -5309.75 kJ/mol; ALS |
ΔcH°solid | -5303.2 | kJ/mol | Ccb | Lemoult, 1907 | ALS |
Constant pressure heat capacity of solid
Cp,solid (J/mol*K) | Temperature (K) | Reference | Comment |
---|---|---|---|
125.9 | 293. | Campbell and Campbell, 1940 | DH |

Phase change data

Data compiled as indicated in comments:
BS - Robert L. Brown and Stephen E. Stein
TRC - Thermodynamics Research Center, NIST Boulder Laboratories, Chris Muzny director
AC - William E. Acree, Jr., James S. Chickos
ALS - Hussein Y. Afeefy, Joel F. Liebman, and Stephen E. Stein
Quantity | Value | Units | Method | Reference | Comment |
---|---|---|---|---|---|
Tboil | 579.2 | K | N/A | Aldrich Chemical Company Inc., 1990 | BS |
Quantity | Value | Units | Method | Reference | Comment |
Tfus | 383. ± 3. | K | AVG | N/A | Average of 8 values; Individual data points |
Quantity | Value | Units | Method | Reference | Comment |
ΔsubH° | 73.9 | kJ/mol | A | Stephenson and Malanowski, 1987 | Based on data from 283. to 323. K.; AC |
Enthalpy of vaporization
ΔvapH (kJ/mol) | Temperature (K) | Method | Reference | Comment |
---|---|---|---|---|
63.5 | 403. | A | Stephenson and Malanowski, 1987 | Based on data from 388. to 579. K. See also Stull, 1947.; AC |
Enthalpy of sublimation
ΔsubH (kJ/mol) | Temperature (K) | Method | Reference | Comment |
---|---|---|---|---|
74.06 ± 0.84 | 283. | V | Karyakin, Rabinovich, et al., 1968 | ALS |
Enthalpy of fusion
ΔfusH (kJ/mol) | Temperature (K) | Reference | Comment |
---|---|---|---|
23.33 | 386.2 | Acree, 1991 | AC |

Gas phase ion energetics data

Data evaluated as indicated in comments:
L - Sharon G. Lias
Data compiled as indicated in comments:
LBLHLM - Sharon G. Lias, John E. Bartmess, Joel F. Liebman, John L. Holmes, Rhoda D. Levin, and W. Gary Mallard
LLK - Sharon G. Lias, Rhoda D. Levin, and Sherif A. Kafafi
RDSH - Henry M. Rosenstock, Keith Draxl, Bruce W. Steiner, and John T. Herron
Quantity | Value | Units | Method | Reference | Comment |
---|---|---|---|---|---|
IE (evaluated) | 7.1 ± 0.1 | eV | N/A | N/A | L |
Ionization energy determinations
IE (eV) | Method | Reference | Comment |
---|---|---|---|
7.03 | PE | Klasinc, Kovac, et al., 1983 | LBLHLM |
7.10 ± 0.02 | PE | Maier, 1974 | LLK |
7.4 ± 0.1 | CTS | Farrell and Newton, 1966 | RDSH |
7.2 | PI | Terenin, 1961 | RDSH |
7.5 | CTS | Briegleb and Czekalla, 1959 | RDSH |
7.55 | PE | Klasinc, Kovac, et al., 1983 | Vertical value; LBLHLM |
7.56 | PE | Utsunomiya, Kobayashi, et al., 1975 | Vertical value; LLK |
Appearance energy determinations
Ion | AE (eV) | Other Products | Method | Reference | Comment |
---|---|---|---|---|---|
C9H7+ | 14.28 | HCN+H | EI | Occolowitz and White, 1968 | RDSH |
C9H8+ | 12.59 | HCN | EI | Occolowitz and White, 1968 | RDSH |

Kovats' RI, non-polar column, isothermal

Column type | Active phase | Temperature (C) | I | Reference | Comment |
---|---|---|---|---|---|
Packed | SE-30 | 180. | 1535. | Oszczapowicz, Osek, et al., 1984 | N2, Chromosorb W AW; Column length: 3. m |

Van Den Dool and Kratz RI, non-polar column, temperature ramp

Column type | Active phase | I | Reference | Comment |
---|---|---|---|---|
Capillary | DB-1 | 1484.8 | Sun and Stremple, 2003 | 30. m/0.25 mm/0.25 μm, He, 3. K/min; Tstart: 40. C; Tend: 325. C |
Capillary | OV-1 | 1510.2 | Gautzsch and Zinn, 1996 | 8. K/min; Tstart: 35. C; Tend: 300. C |
Capillary | DB-5 | 1562. | Rostad and Pereira, 1986 | 30. m/0.26 mm/0.25 μm, He, 50. C @ 4. min, 6. K/min, 300. C @ 20. min |

Normal alkane RI, non-polar column, temperature ramp

Column type | Active phase | I | Reference | Comment |
---|---|---|---|---|
Capillary | Ultra-1 | 1486. | Okumura, 1991 | 25. m/0.32 mm/0.25 μm, He, 3. K/min; Tstart: 80. C; Tend: 260. C |

Lee's RI, non-polar column, temperature ramp

Column type | Active phase | I | Reference | Comment |
---|---|---|---|---|
Capillary | DB-5MS | 264.23 | Chen, Keeran, et al., 2002 | 30. m/0.25 mm/0.5 μm, 40. C @ 1. min, 10. K/min; Tend: 310. C |
Capillary | DB-5MS | 264.62 | Chen, Keeran, et al., 2002 | 30. m/0.25 mm/0.5 μm, 40. C @ 1. min, 4. K/min; Tend: 310. C |
Capillary | SE-52 | 264.34 | Hasegawa, Usami, et al., 1990 | 2. K/min; Column length: 12. m; Column diameter: 0.25 mm; Tstart: 50. C; Tend: 270. C |
Capillary | DB-5 | 264.85 | Rostad and Pereira, 1986 | 30. m/0.26 mm/0.25 μm, He, 50. C @ 4. min, 6. K/min, 300. C @ 20. min |
Capillary | SE-52 | 265.53 | Vassilaros, Kong, et al., 1982 | 20. m/0.30 mm/0.25 μm, H2, 40. C @ 2. min, 4. K/min; Tend: 265. C |

References

Pushin, 1954
Pushin, N.A.,
Heats of combustion and heats of formation of isomeric organic compounds,
Bull. Soc. Chim. Belgrade, 1954, 19, 531-547. [all data]
Schmidt and Becker, 1933
Schmidt, V.A.; Becker, F.,
Die Bildungswarme von Nitrocellulofen, Nitroglycerin und anderen widuigen Beltandteilen von Treibmitteln,
Z. Gesamte Schiess Sprengstoffwes., 1933, 33, 280-282. [all data]
Lemoult, 1907
Lemoult, M.P.,
Recherches theoriques et experimentales sur les chaleurs de combustion et de formation des composes organiques,
Ann. Chim. Phys., 1907, 12, 395-432. [all data]
Willis, 1947
Willis, J.B.,
The heats of combustion of some organic bases and their salts. The resonance energies of acridine and phenazine,
Trans. Faraday Soc., 1947, 43, 97-102. [all data]
Cox and Pilcher, 1970
Cox, J.D.; Pilcher, G.,
Thermochemistry of Organic and Organometallic Compounds, Academic Press, New York, 1970, 1-636. [all data]
Milone and Rossignoli, 1932
Milone, M.; Rossignoli, P.,
Sul calore di combustione di alcune miscele di composti organici,
Gazz. Chim. Ital., 1932, 62, 644-655. [all data]
Campbell and Campbell, 1940
Campbell, A.N.; Campbell, A.J.R.,
The heats of solution, heats of formation,
specific heats and equilibrium diagrams of certain molecular compounds. J. Am. Chem. Soc., 1940, 62, 291-297. [all data]
Aldrich Chemical Company Inc., 1990
Aldrich Chemical Company Inc.,
Catalog Handbook of Fine Chemicals, Aldrich Chemical Company, Inc., Milwaukee WI, 1990, 1. [all data]
Stephenson and Malanowski, 1987
Stephenson, Richard M.; Malanowski, Stanislaw,
Handbook of the Thermodynamics of Organic Compounds, 1987, https://doi.org/10.1007/978-94-009-3173-2
. [all data]
Stull, 1947
Stull, Daniel R.,
Vapor Pressure of Pure Substances. Organic and Inorganic Compounds,
Ind. Eng. Chem., 1947, 39, 4, 517-540, https://doi.org/10.1021/ie50448a022
. [all data]
Karyakin, Rabinovich, et al., 1968
Karyakin, N.V.; Rabinovich, I.B.; Pakhomov, L.G.,
Heats of sublimation of naphthalene and its monosubstituted β-derivatives,
Russ. J. Phys. Chem. (Engl. Transl.), 1968, 42, 954. [all data]
Acree, 1991
Acree, William E.,
Thermodynamic properties of organic compounds: enthalpy of fusion and melting point temperature compilation,
Thermochimica Acta, 1991, 189, 1, 37-56, https://doi.org/10.1016/0040-6031(91)87098-H
. [all data]
Klasinc, Kovac, et al., 1983
Klasinc, L.; Kovac, B.; Gusten, H.,
Photoelectron spectra of acenes. Electronic structure and substituent effects,
Pure Appl. Chem., 1983, 55, 289. [all data]
Maier, 1974
Maier, J.P.,
Photoelectron spectroscopy of peri- amino naphthalenes,
Helv. Chim. Acta, 1974, 57, 994. [all data]
Farrell and Newton, 1966
Farrell, P.G.; Newton, J.,
Ionization potentials of primary aromatic amines and aza-hydrocarbons,
Tetrahedron Lett., 1966, 5517. [all data]
Terenin, 1961
Terenin, A.,
Charge transfer in organic solids, induced by light,
Proc. Chem. Soc., London, 1961, 321. [all data]
Briegleb and Czekalla, 1959
Briegleb, G.; Czekalla, J.,
Die Bestimmung von lonisierungsenergien aus den Spektren von Elektronenubergangskomplexen,
Z.Elektrochem., 1959, 63, 6. [all data]
Utsunomiya, Kobayashi, et al., 1975
Utsunomiya, C.; Kobayashi, T.; Nagakura, S.,
Photoelectron spectra of substituted naphthalenes,
Bull. Chem. Soc. Jpn., 1975, 48, 1852. [all data]
Occolowitz and White, 1968
Occolowitz, J.L.; White, G.L.,
Energetic considerations in the assignment of some fragment ion structures,
Australian J. Chem., 1968, 21, 997. [all data]