2H-1-Benzopyran-2-one, 7-(diethylamino)-4-methyl-
- Formula: C14H17NO2
- Molecular weight: 231.2903
- IUPAC Standard InChIKey: AFYCEAFSNDLKSX-UHFFFAOYSA-N
- CAS Registry Number: 91-44-1
- Chemical structure:

Phase change data

Data compiled as indicated in comments:
TRC - Thermodynamics Research Center, NIST Boulder Laboratories, Chris Muzny director
DH - Eugene S. Domalski and Elizabeth D. Hearing
Quantity | Value | Units | Method | Reference | Comment |
---|---|---|---|---|---|
Tfus | 344.39 | K | N/A | Witschonke, 1954 | Uncertainty assigned by TRC = 0.3 K; TRC |
Tfus | 344.85 | K | N/A | Witschonke, 1954 | Uncertainty assigned by TRC = 0.2 K; TRC |
Enthalpy of fusion
ΔfusH (kJ/mol) | Temperature (K) | Reference | Comment |
---|---|---|---|
17.884 | 343.8 | Zhang, Huang, et al., 1989 | DH |
Entropy of fusion
ΔfusS (J/mol*K) | Temperature (K) | Reference | Comment |
---|---|---|---|
46.26 | 343.8 | Zhang, Huang, et al., 1989 | DH |

Gas phase ion energetics data

Data compiled by: Sharon G. Lias and Joel F. Liebman
Ionization energy determinations
IE (eV) | Method | Reference | Comment |
---|---|---|---|
7.38 | PE | Redchenko, Safronov, et al., 1992 | Vertical value |

References

Witschonke, 1954
Witschonke, C.R.,
Freezing point and purity data for some organic compounds,
Anal. Chem., 1954, 26, 562-4. [all data]
Zhang, Huang, et al., 1989
Zhang, X.; Huang, W.; Tan, F.; Xu, G.; Wu, Z.,
Study on phase transition thermodynamics of 4-methyl-coumarin derivative,
Chin. Sci. Bull., 1989, 34(21), 1844-1845. [all data]
Redchenko, Safronov, et al., 1992
Redchenko, V.V.; Safronov, A.I.; Kirpichenok, M.A.; Grandberg, I.I.; Traven', V.F.,
Electronic structure of π-systems. XV. Photoelectron spectra of 7-aminocoumarin derivatives,
J. Gen. Chem. USSR, 1992, 62, 2313. [all data]