Isoquinoline, 1,2,3,4-tetrahydro-
- Formula: C9H11N
- Molecular weight: 133.1903
- IUPAC Standard InChIKey: UWYZHKAOTLEWKK-UHFFFAOYSA-N
- CAS Registry Number: 91-21-4
- Chemical structure:
View 3d structure (requires JavaScript / HTML 5) - Other names: 1,2,3,4-Tetrahydroisoquinoline; Tetrahydroisoquinoline; 1,2,3,4-Tetrahydro-2-isoquinoline; 1,2,3,4-Tetrahydro-2-azanaphthalene

Gas phase ion energetics data

Data compiled as indicated in comments:
LLK - Sharon G. Lias, Rhoda D. Levin, and Sherif A. Kafafi
RDSH - Henry M. Rosenstock, Keith Draxl, Bruce W. Steiner, and John T. Herron
Ionization energy determinations
IE (eV) | Method | Reference | Comment |
---|---|---|---|
8.63 | EI | Loudon, Maccoll, et al., 1970 | RDSH |
8.57 ± 0.05 | PE | Morishima, Yoshikawa, et al., 1975 | Vertical value; LLK |
Appearance energy determinations
Ion | AE (eV) | Other Products | Method | Reference | Comment |
---|---|---|---|---|---|
C8H8+ | 11.10 | ? | EI | Loudon, Maccoll, et al., 1970 | RDSH |

Phase change data

Data compiled by: Robert L. Brown and Stephen E. Stein
Quantity | Value | Units | Method | Reference | Comment |
---|---|---|---|---|---|
Tboil | 505.7 | K | N/A | Weast and Grasselli, 1989 |

References

Loudon, Maccoll, et al., 1970
Loudon, A.G.; Maccoll, A.; Wong, S.K.,
Comparison between unimolecular gas phase pyrolysis and electron impact fragmentation. Part I. The mass spectra of tetralin and some related heterocycles,
J. Chem. Soc. B, 1970, 1727. [all data]
Morishima, Yoshikawa, et al., 1975
Morishima, I.; Yoshikawa, K.; Hashimoto, M.; Bekki, K.,
Homoallylic interaction between the nitrogen lone pair and the nonadjacent π bond in cyclic and bicyclic amines. I. Photoelectron spectroscopic study,
J. Am. Chem. Soc., 1975, 97, 4283. [all data]