1,2-Benzenedicarbonitrile
- Formula: C8H4N2
- Molecular weight: 128.1308
- IUPAC Standard InChIKey: XQZYPMVTSDWCCE-UHFFFAOYSA-N
- CAS Registry Number: 91-15-6
- Chemical structure:
View 3d structure (requires JavaScript / HTML 5) - Other names: Phthalonitrile; o-Benzenedicarbonitrile; o-Cyanobenzonitrile; o-Dicyanobenzene; Phthalodinitrile; 1,2-Dicyanobenzene; o-Phthalodinitrile; o-PDN; Phthalic acid dinitrile; USAF ND-09; 1,2-Benzodinitrile; 1,2-Benzendikarbonitril; Ftalodinitril; Ftalonitril; o-Benzenedinitrile; NSC 17562

Gas phase thermochemistry data

Data compiled as indicated in comments:
DRB - Donald R. Burgess, Jr.
ALS - Hussein Y. Afeefy, Joel F. Liebman, and Stephen E. Stein
Quantity | Value | Units | Method | Reference | Comment |
---|---|---|---|---|---|
ΔfH°gas | 368.3 | kJ/mol | N/A | Rabinovich, Karyakin, et al., 1984 | Value computed using ΔfHsolid° value of 281.4±1.9 kj/mol from Rabinovich, Karyakin, et al., 1984 and ΔsubH° value of 86.9 kj/mol from Rabinovich, Karyakin, et al., 1984.; DRB |
ΔfH°gas | 367.5 ± 1.9 | kJ/mol | Ccb | Sato-Toshima, Sakiyama, et al., 1980 | ALS |
ΔfH°gas | 362.0 | kJ/mol | N/A | Salley and Gray, 1951 | Value computed using ΔfHsolid° value of 275.1 kj/mol from Salley and Gray, 1951 and ΔsubH° value of 86.9 kj/mol from Salley and Gray, 1951.; DRB |

Condensed phase thermochemistry data

Data compiled as indicated in comments:
ALS - Hussein Y. Afeefy, Joel F. Liebman, and Stephen E. Stein
DH - Eugene S. Domalski and Elizabeth D. Hearing
Quantity | Value | Units | Method | Reference | Comment |
---|---|---|---|---|---|
ΔfH°solid | 281.4 ± 1.9 | kJ/mol | Ccb | Rabinovich, Karyakin, et al., 1984 | Heat of combustion is not reported; ALS |
ΔfH°solid | 280.6 ± 1.2 | kJ/mol | Ccb | Sato-Toshima, Sakiyama, et al., 1980 | ALS |
ΔfH°solid | 275.1 | kJ/mol | Ccb | Salley and Gray, 1951 | correction of Salley and Gray, 1948; ALS |
Quantity | Value | Units | Method | Reference | Comment |
ΔcH°solid | -4000.36 ± 0.67 | kJ/mol | Ccb | Sato-Toshima, Sakiyama, et al., 1980 | ALS |
ΔcH°solid | -3994.9 | kJ/mol | Ccb | Salley and Gray, 1951 | correction of Salley and Gray, 1948; ALS |
Quantity | Value | Units | Method | Reference | Comment |
S°solid,1 bar | 192.4 | J/mol*K | N/A | Rabinovich, Karyakin, et al., 1984, 2 | DH |
S°solid,1 bar | 192.4 | J/mol*K | N/A | Karyakin, Shvetsova, et al., 1982 | DH |
Constant pressure heat capacity of solid
Cp,solid (J/mol*K) | Temperature (K) | Reference | Comment |
---|---|---|---|
161.3 | 298.15 | Rabinovich, Karyakin, et al., 1984, 2 | T = 13 to 500 K.; DH |
161.3 | 298.15 | Karyakin, Shvetsova, et al., 1982 | T = 13 to 480 K.; DH |

Phase change data

Data compiled as indicated in comments:
BS - Robert L. Brown and Stephen E. Stein
TRC - Thermodynamics Research Center, NIST Boulder Laboratories, Chris Muzny director
ALS - Hussein Y. Afeefy, Joel F. Liebman, and Stephen E. Stein
DRB - Donald R. Burgess, Jr.
AC - William E. Acree, Jr., James S. Chickos
DH - Eugene S. Domalski and Elizabeth D. Hearing
Quantity | Value | Units | Method | Reference | Comment |
---|---|---|---|---|---|
Tfus | 414. | K | N/A | Buckingham and Donaghy, 1982 | BS |
Tfus | 412.92 | K | N/A | Witschonke, 1954 | Uncertainty assigned by TRC = 0.25 K; TRC |
Tfus | 413.05 | K | N/A | Witschonke, 1954 | Uncertainty assigned by TRC = 0.2 K; TRC |
Quantity | Value | Units | Method | Reference | Comment |
Ttriple | 414.0 | K | N/A | Rabinovich, Nistratov, et al., 1984 | Uncertainty assigned by TRC = 0.2 K; TRC |
Ttriple | 414.0 | K | N/A | Karyikin, Shvetsova, et al., 1982 | Uncertainty assigned by TRC = 0.1 K; TRC |
Quantity | Value | Units | Method | Reference | Comment |
ΔsubH° | 86.9 ± 1.5 | kJ/mol | V | Sato-Toshima, Sakiyama, et al., 1980 | ALS |
ΔsubH° | 86.9 | kJ/mol | N/A | Sato-Toshima, Sakiyama, et al., 1980 | DRB |
ΔsubH° | 86.9 ± 1.5 | kJ/mol | GS | Sato-Toshima, Sakiyama, et al., 1980 | AC |
Reduced pressure boiling point
Tboil (K) | Pressure (bar) | Reference | Comment |
---|---|---|---|
423. to 425. | 0.013 | Buckingham and Donaghy, 1982 | BS |
Enthalpy of fusion
ΔfusH (kJ/mol) | Temperature (K) | Reference | Comment |
---|---|---|---|
20.000 | 414.0 | Rabinovich, Karyakin, et al., 1984, 2 | DH |
20.000 | 414.0 | Karyakin, Shvetsova, et al., 1982 | DH |
20.0 | 414.1 | Karyakin, Shvetsova, et al., 1982, 2 | AC |
Entropy of fusion
ΔfusS (J/mol*K) | Temperature (K) | Reference | Comment |
---|---|---|---|
48.26 | 414.0 | Rabinovich, Karyakin, et al., 1984, 2 | DH |
48.26 | 414.0 | Karyakin, Shvetsova, et al., 1982 | DH |

Gas phase ion energetics data

Data compiled as indicated in comments:
LLK - Sharon G. Lias, Rhoda D. Levin, and Sherif A. Kafafi
B - John E. Bartmess
Electron affinity determinations
EA (eV) | Method | Reference | Comment |
---|---|---|---|
0.954 ± 0.087 | TDEq | Chowdhury and Kebarle, 1986 | ΔGea(423 K) = -22.3 kcal/mol; ΔSea (estimated) = +1.0 eu.; B |
1.11 ± 0.13 | SI | Farragher and Page, 1967 | The Magnetron method, lacking mass analysis, is not considered reliable.; B |
Ionization energy determinations
IE (eV) | Method | Reference | Comment |
---|---|---|---|
9.9 | PE | Palmer, Moyes, et al., 1980 | LLK |
9.9 | PE | Neijzen and DeLange, 1978 | LLK |
10.27 | PE | Palmer, Moyes, et al., 1980 | Vertical value; LLK |
10.10 | PE | Neijzen and DeLange, 1978 | Vertical value; LLK |

Normal alkane RI, non-polar column, temperature ramp

Column type | Active phase | I | Reference | Comment |
---|---|---|---|---|
Capillary | ZB-5 | 1304. | Kluchinsky, Sheely, et al., 2002 | 30. m/0.25 mm/0.25 μm, He, 10. K/min, 200. C @ 2. min; Tstart: 40. C |

References

Rabinovich, Karyakin, et al., 1984
Rabinovich, I.B.; Karyakin, N.V.; Dzharimova, E.S.; Siling, S.A.; Ponomarev, I.I.; Vinogradova, S.V.,
Thermodynamics of condensation of phthalonitrile with m-phenylenediamine,
Bull. Acad. Sci. USSR, Div. Chem. Sci., 1984, 716-723. [all data]
Sato-Toshima, Sakiyama, et al., 1980
Sato-Toshima, T.; Sakiyama, M.; Seki, S.,
Thermochemical estimation of destabilization energies of 1,2-, 1,3-, and 1,4-dicyanobenzenes due to interactions between substituents. Appendix: Dipole moments in solution of the dicyanobenzenes,
Bull. Chem. Soc. Jpn., 1980, 53, 2762-2767. [all data]
Salley and Gray, 1951
Salley, D.J.; Gray, J.B.,
Heats of combustion of some organic nitrogen compounds,
J. Am. Chem. Soc., 1951, 73, 5925. [all data]
Salley and Gray, 1948
Salley, D.J.; Gray, J.B.,
Heats of combustion of some organic nitrogen compounds,
J. Am. Chem. Soc., 1948, 70, 2650-2653. [all data]
Rabinovich, Karyakin, et al., 1984, 2
Rabinovich, I.B.; Karyakin, N.V.; Dzharimova, E.S.; Siling, S.A.; Ponomarev, I.I.; Vinogradova, S.V.,
Thermodynamics of the condensation of o-phthalic acid dinitrile with m-phenylenediamine, Izv. Akad. Nauk SSSR,
Ser. Khim., 1984, (4), 779-787. [all data]
Karyakin, Shvetsova, et al., 1982
Karyakin, N.V.; Shvetsova, K.G.; Dzharimova, E.S.,
Thermodynamic properties of o-phthalic acid dinitrile, 1982, Termodin. [all data]
Buckingham and Donaghy, 1982
Buckingham, J.; Donaghy, S.M.,
Dictionary of Organic Compounds: Fifth Edition, Chapman and Hall, New York, 1982, 1. [all data]
Witschonke, 1954
Witschonke, C.R.,
Freezing point and purity data for some organic compounds,
Anal. Chem., 1954, 26, 562-4. [all data]
Rabinovich, Nistratov, et al., 1984
Rabinovich, I.B.; Nistratov, V.P.; Babinkov, A.G.; Siling, S.A.; Ponomarev, I.I.; Vinogradova, S.V.,
Thermodynamics of the condensation of o-phthalic acid dinitrile with m-phenylenediamine,
Izv. Akad. Nauk SSSR, 1984, 1984, 779. [all data]
Karyikin, Shvetsova, et al., 1982
Karyikin, N.V.; Shvetsova, K.G.; Dzharimova, E.S.,
Thermodynamic properties of o-phthalic acid dinitrile,
Termodin. Org. Soedin., 1982, 33-37. [all data]
Karyakin, Shvetsova, et al., 1982, 2
Karyakin, N.V.; Shvetsova, K.G.; Dzharimova, E.S.,
Termodin. Org. Soedin., 1982, 33. [all data]
Chowdhury and Kebarle, 1986
Chowdhury, S.; Kebarle, P.,
Electron affinities of di- and tetracyanoethylene and cyanobenzenes based on measurements of gas-phase electron transfer equilibria,
J. Am. Chem. Soc., 1986, 108, 5453. [all data]
Farragher and Page, 1967
Farragher, A.L.; Page, F.M.,
Experimental Determination of Electron Affinities. Part 11. - Electron Capture by Some Cyanocarbons and Related Compounds,
Trans. Farad. Soc., 1967, 63, 2369, https://doi.org/10.1039/tf9676302369
. [all data]
Palmer, Moyes, et al., 1980
Palmer, M.H.; Moyes, W.; Spiers, M.,
The electronic structure of substituted benzenes: Ab initio calculations and photoelectron spectra for benzonitrile, the tolunitriles, fluorobenzonitriles, dicyanobenzenes and ethynylbenzene,
J. Mol. Struct., 1980, 62, 165. [all data]
Neijzen and DeLange, 1978
Neijzen, B.J.M.; DeLange, C.A.,
Photoelectron spectroscopy of mono-dicyanobenzenes their perfluoro derivatives,
J. Electron Spectrosc. Relat. Phenom., 1978, 14, 187. [all data]
Kluchinsky, Sheely, et al., 2002
Kluchinsky, T.A., Jr.; Sheely, M.V.; Savage, P.B.; Smith, P.A.,
Formation of 2-chlorobenzylidenemalononitrile (CS riot control agent) thermal degradation products at elevated temperatures,
J. Chromatogr. A, 2002, 952, 1-2, 205-213, https://doi.org/10.1016/S0021-9673(02)00096-1
. [all data]