1-Naphthalenamine, N-phenyl-
- Formula: C16H13N
- Molecular weight: 219.2811
- IUPAC Standard InChIKey: XQVWYOYUZDUNRW-UHFFFAOYSA-N
- CAS Registry Number: 90-30-2
- Chemical structure:
View 3d structure (requires JavaScript / HTML 5) - Other names: 1-Naphthylamine, N-phenyl-; α-Naphthylphenylamine; Antioxidant PAN; C.I. 44050; N-(1-Naphthyl)aniline; N-Phenyl-α-naphthylamine; N-Phenyl-1-naphthylamine; Neozone A; Nonox A; Phenyl-α-naphthylamine; Phenyl-1-naphthylamine; α-Phenylnaphthylamine; Aceto PAN; Phenylnaphthylamine; 1-Anilinonaphthalene; Additin 30; N-Fenyl-1-aminonaftalen; Fenyl-α-naftylamin; Neozon A; PANA; Vulkanox PAN; Nonox AN; N-Phenyl-1-naphthalenamine; N-Phenyl-1-aminonaphthalene; Nocrac PA; Algerite; Naugard PANA; 1-Naphthyl phenyl amine; Amoco 32; NSC 2622

Condensed phase thermochemistry data

Data compiled by: Hussein Y. Afeefy, Joel F. Liebman, and Stephen E. Stein
Quantity | Value | Units | Method | Reference | Comment |
---|---|---|---|---|---|
ΔfH°solid | 293. | kJ/mol | Ccb | Lemoult, 1906 | Author value for hf298-condensed=61.7 kcal/mol |
Quantity | Value | Units | Method | Reference | Comment |
ΔcH°solid | -8447.5 | kJ/mol | Ccb | Lemoult, 1906 | Author value for hf298-condensed=61.7 kcal/mol |

Phase change data

Data compiled as indicated in comments:
BS - Robert L. Brown and Stephen E. Stein
AC - William E. Acree, Jr., James S. Chickos
Reduced pressure boiling point
Tboil (K) | Pressure (bar) | Reference | Comment |
---|---|---|---|
499.2 | 0.020 | Weast and Grasselli, 1989 | BS |
Enthalpy of vaporization
ΔvapH (kJ/mol) | Temperature (K) | Method | Reference | Comment |
---|---|---|---|---|
89.6 | 353. | A | Stephenson and Malanowski, 1987 | Based on data from 338. to 368. K.; AC |
Enthalpy of sublimation
ΔsubH (kJ/mol) | Temperature (K) | Method | Reference | Comment |
---|---|---|---|---|
96.5 | 323. | GS | Stephenson and Malanowski, 1987 | Based on data from 313. to 333. K. See also Fel'dshtein and Kuz'minskii, 1971.; AC |

Gas phase ion energetics data

Data compiled by: Henry M. Rosenstock, Keith Draxl, Bruce W. Steiner, and John T. Herron
Ionization energy determinations
IE (eV) | Method | Reference |
---|---|---|
7.12 | CTS | Kinoshita, 1962 |

Van Den Dool and Kratz RI, non-polar column, custom temperature program

Column type | Active phase | I | Reference | Comment |
---|---|---|---|---|
Capillary | 5 % Phenyl methyl siloxane | 2135. | Yasuhara, Shiraishi, et al., 1997 | 25. m/0.31 mm/0.52 μm, He; Program: 50C(2min) => (20C/min) => 120C => (7C/min) => 310C(10min) |

Normal alkane RI, non-polar column, custom temperature program

Column type | Active phase | I | Reference | Comment |
---|---|---|---|---|
Capillary | HP-5 | 2135. | Zhao, Li, et al., 2008 | 30. m/0.25 mm/0.25 μm; Program: not specified |

References

Lemoult, 1906
Lemoult, M.P.,
Thermochimie. - Chaleur de combustion et de formation de quelques composes cycliques azotes,
Compt. Rend., 1906, 143, 772-775. [all data]
Weast and Grasselli, 1989
CRC Handbook of Data on Organic Compounds, 2nd Editon, Weast,R.C and Grasselli, J.G., ed(s)., CRC Press, Inc., Boca Raton, FL, 1989, 1. [all data]
Stephenson and Malanowski, 1987
Stephenson, Richard M.; Malanowski, Stanislaw,
Handbook of the Thermodynamics of Organic Compounds, 1987, https://doi.org/10.1007/978-94-009-3173-2
. [all data]
Fel'dshtein and Kuz'minskii, 1971
Fel'dshtein, L.S.; Kuz'minskii, A.S.,
Kauch. Rezina, 1971, 30, 11, 15. [all data]
Kinoshita, 1962
Kinoshita, M.,
The absorption spectra of the molecular complexes of aromatic compounds with p-bromanil,
Bull. Chem. Soc. Japan, 1962, 35, 1609. [all data]
Bol'shakov, et al., 1969
Bol'shakov, G.F., et al.,
Ultraviolet spectra of heteroorganic compounds, 1969, 170. [all data]
Yasuhara, Shiraishi, et al., 1997
Yasuhara, A.; Shiraishi, H.; Nishikawa, M.; Yamamoto, T.; Uehiro, T.; Nakasugi, O.; Okumura, T.; Kenmotsu, K.; Fukui, H.; Nagase, M.; Ono, Y.; Kawagoshi, Y.; Baba, K.; Noma, Y.,
Determination of organic components in leachates from hazardous waste disposal sites in Japan by gas chromatography-mass spectrometry,
J. Chromatogr. A, 1997, 774, 1-2, 321-332, https://doi.org/10.1016/S0021-9673(97)00078-2
. [all data]
Zhao, Li, et al., 2008
Zhao, Y.; Li, J.; Xu, Y.; Duan, H.; Fan, W.; Zhao, G.,
EXtraction, preparation and identification of volatile compounds in Changyu XO brandy,
Chinese J. Chromatogr., 2008, 26, 2, 212-222, https://doi.org/10.1016/S1872-2059(08)60014-0
. [all data]