Naphthalene, 1-chloro-
- Formula: C10H7Cl
- Molecular weight: 162.616
- IUPAC Standard InChIKey: JTPNRXUCIXHOKM-UHFFFAOYSA-N
- CAS Registry Number: 90-13-1
- Chemical structure:
View 3d structure (requires JavaScript / HTML 5) - Other names: α-Chloronaphthalene; 1-Chloronaphthalene; 1-Naphthyl chloride; α-naphthyl chloride; α-Chlornaphthalene; 1-Chlornaftalen; alpha-Chloronaphthalene; alpha-Naphthyl chloride; 1-Naphthalenyl chloride; NSC 6166; Monochloro naphthalene

Gas phase thermochemistry data

Data compiled by: Hussein Y. Afeefy, Joel F. Liebman, and Stephen E. Stein
Quantity | Value | Units | Method | Reference | Comment |
---|---|---|---|---|---|
ΔfH°gas | 115. ± 9.6 | kJ/mol | Ccb | Smith, Bjellerup, et al., 1953 | hf_HCl.600H2O=-39.82 |

Condensed phase thermochemistry data

Data compiled as indicated in comments:
ALS - Hussein Y. Afeefy, Joel F. Liebman, and Stephen E. Stein
DH - Eugene S. Domalski and Elizabeth D. Hearing
Quantity | Value | Units | Method | Reference | Comment |
---|---|---|---|---|---|
ΔfH°liquid | 49.8 ± 8.4 | kJ/mol | Ccb | Smith, Bjellerup, et al., 1953 | hf_HCl.600H2O=-39.82; ALS |
Quantity | Value | Units | Method | Reference | Comment |
ΔcH°liquid | -5009.2 ± 8.4 | kJ/mol | Ccb | Smith, Bjellerup, et al., 1953 | hf_HCl.600H2O=-39.82; ALS |
Constant pressure heat capacity of liquid
Cp,liquid (J/mol*K) | Temperature (K) | Reference | Comment |
---|---|---|---|
212.60 | 298.15 | Costas, Huu, et al., 1988 | DH |
211.28 | 298.15 | Wilhelm, Lainez, et al., 1986 | DH |
211.37 | 298.15 | Grolier, Inglese, et al., 1981 | DH |

Phase change data

Data compiled as indicated in comments:
BS - Robert L. Brown and Stephen E. Stein
TRC - Thermodynamics Research Center, NIST Boulder Laboratories, Chris Muzny director
AC - William E. Acree, Jr., James S. Chickos
ALS - Hussein Y. Afeefy, Joel F. Liebman, and Stephen E. Stein
Quantity | Value | Units | Method | Reference | Comment |
---|---|---|---|---|---|
Tfus | 270.7 | K | N/A | Khanna, Khetarpal, et al., 1981 | Uncertainty assigned by TRC = 0.5 K; TRC |
Quantity | Value | Units | Method | Reference | Comment |
ΔvapH° | 64.7 | kJ/mol | N/A | Bolotnikov and Neruchev, 2006 | AC |
ΔvapH° | 62.0 ± 0.4 | kJ/mol | GS | Verevkin, 2003 | Based on data from 289. to 332. K.; AC |
ΔvapH° | 64.0 ± 0.3 | kJ/mol | GS | Puri, Chickos, et al., 2001 | AC |
ΔvapH° | 65.3 ± 5.0 | kJ/mol | V | Smith, Bjellerup, et al., 1953 | hf_HCl.600H2O=-39.82; ALS |
Reduced pressure boiling point
Tboil (K) | Pressure (bar) | Reference | Comment |
---|---|---|---|
385.2 | 0.007 | Aldrich Chemical Company Inc., 1990 | BS |
Enthalpy of vaporization
ΔvapH (kJ/mol) | Temperature (K) | Method | Reference | Comment |
---|---|---|---|---|
58.6 | 373. | GC | Lei, Wania, et al., 1999 | Based on data from 323. to 423. K.; AC |
59.6 | 368. | A | Stephenson and Malanowski, 1987 | Based on data from 353. to 553. K. See also Stull, 1947.; AC |
57.8 | 415. | A | Stephenson and Malanowski, 1987 | Based on data from 400. to 435. K.; AC |
Antoine Equation Parameters
log10(P) = A − (B / (T + C))
P = vapor pressure (bar)
T = temperature (K)
View plot Requires a JavaScript / HTML 5 canvas capable browser.
Temperature (K) | A | B | C | Reference | Comment |
---|---|---|---|---|---|
353.8 to 532.4 | 3.37416 | 1326.097 | -140.453 | Stull, 1947 | Coefficents calculated by NIST from author's data. |
Enthalpy of fusion
ΔfusH (kJ/mol) | Temperature (K) | Reference | Comment |
---|---|---|---|
12.9 | 270.7 | Acree, 1991 | AC |

Reaction thermochemistry data

Data compiled by: John E. Bartmess
Individual Reactions
C10H6Cl- + =
By formula: C10H6Cl- + H+ = C10H7Cl
Quantity | Value | Units | Method | Reference | Comment |
---|---|---|---|---|---|
ΔrH° | 1594. ± 8.4 | kJ/mol | Bran | Wenthold and Squires, 1995 | gas phase; By HO- cleavage of substituted silanes |
Quantity | Value | Units | Method | Reference | Comment |
ΔrG° | 1561. ± 8.8 | kJ/mol | H-TS | Wenthold and Squires, 1995 | gas phase; By HO- cleavage of substituted silanes |
C10H6Cl- + =
By formula: C10H6Cl- + H+ = C10H7Cl
Quantity | Value | Units | Method | Reference | Comment |
---|---|---|---|---|---|
ΔrH° | 1621. ± 9.6 | kJ/mol | Bran | Wenthold and Squires, 1995 | gas phase; By HO- cleavage of substituted silanes |
Quantity | Value | Units | Method | Reference | Comment |
ΔrG° | 1589. ± 10. | kJ/mol | H-TS | Wenthold and Squires, 1995 | gas phase; By HO- cleavage of substituted silanes |
C10H6Cl- + =
By formula: C10H6Cl- + H+ = C10H7Cl
Quantity | Value | Units | Method | Reference | Comment |
---|---|---|---|---|---|
ΔrH° | 1610. ± 15. | kJ/mol | Bran | Wenthold and Squires, 1995 | gas phase; By HO- cleavage of substituted silanes |
Quantity | Value | Units | Method | Reference | Comment |
ΔrG° | 1577. ± 16. | kJ/mol | H-TS | Wenthold and Squires, 1995 | gas phase; By HO- cleavage of substituted silanes |

Henry's Law data

Data compiled by: Rolf Sander
Henry's Law constant (water solution)
kH(T) = k°H exp(d(ln(kH))/d(1/T) ((1/T) - 1/(298.15 K)))
k°H = Henry's law constant for solubility in water at 298.15 K (mol/(kg*bar))
d(ln(kH))/d(1/T) = Temperature dependence constant (K)
k°H (mol/(kg*bar)) | d(ln(kH))/d(1/T) (K) | Method | Reference |
---|---|---|---|
0.29 | L | N/A | |
0.29 | M | N/A |

Gas phase ion energetics data

Data compiled as indicated in comments:
B - John E. Bartmess
LBLHLM - Sharon G. Lias, John E. Bartmess, Joel F. Liebman, John L. Holmes, Rhoda D. Levin, and W. Gary Mallard
Electron affinity determinations
EA (eV) | Method | Reference | Comment |
---|---|---|---|
0.2771 ± 0.0035 | ECD | Steelhammer and Wentworth, 1969 | B |
Ionization energy determinations
IE (eV) | Method | Reference | Comment |
---|---|---|---|
8.13 | PE | Klasinc, Kovac, et al., 1983 | LBLHLM |
De-protonation reactions
C10H6Cl- + =
By formula: C10H6Cl- + H+ = C10H7Cl
Quantity | Value | Units | Method | Reference | Comment |
---|---|---|---|---|---|
ΔrH° | 1594. ± 8.4 | kJ/mol | Bran | Wenthold and Squires, 1995 | gas phase; By HO- cleavage of substituted silanes; B |
Quantity | Value | Units | Method | Reference | Comment |
ΔrG° | 1561. ± 8.8 | kJ/mol | H-TS | Wenthold and Squires, 1995 | gas phase; By HO- cleavage of substituted silanes; B |
C10H6Cl- + =
By formula: C10H6Cl- + H+ = C10H7Cl
Quantity | Value | Units | Method | Reference | Comment |
---|---|---|---|---|---|
ΔrH° | 1621. ± 9.6 | kJ/mol | Bran | Wenthold and Squires, 1995 | gas phase; By HO- cleavage of substituted silanes; B |
Quantity | Value | Units | Method | Reference | Comment |
ΔrG° | 1589. ± 10. | kJ/mol | H-TS | Wenthold and Squires, 1995 | gas phase; By HO- cleavage of substituted silanes; B |
C10H6Cl- + =
By formula: C10H6Cl- + H+ = C10H7Cl
Quantity | Value | Units | Method | Reference | Comment |
---|---|---|---|---|---|
ΔrH° | 1610. ± 15. | kJ/mol | Bran | Wenthold and Squires, 1995 | gas phase; By HO- cleavage of substituted silanes; B |
Quantity | Value | Units | Method | Reference | Comment |
ΔrG° | 1577. ± 16. | kJ/mol | H-TS | Wenthold and Squires, 1995 | gas phase; By HO- cleavage of substituted silanes; B |

Van Den Dool and Kratz RI, non-polar column, temperature ramp

Column type | Active phase | I | Reference | Comment |
---|---|---|---|---|
Capillary | OV-1 | 1356.1 | Gautzsch and Zinn, 1996 | 8. K/min; Tstart: 35. C; Tend: 300. C |
Capillary | SE-54 | 1354. | Weber, 1986 | 25. m/0.31 mm/0.17 μm, H2, 2. K/min; Tstart: 35. C |
Capillary | SE-54 | 1376. | Weber, 1986 | 25. m/0.31 mm/0.17 μm, H2, 2. K/min; Tstart: 35. C |

Normal alkane RI, non-polar column, temperature ramp

Column type | Active phase | I | Reference | Comment |
---|---|---|---|---|
Capillary | DB-5 | 1382. | Berdague, Denoyer, et al., 1991 | 60. m/0.32 mm/1.0 μm, He, 3. K/min; Tstart: 40. C; Tend: 240. C |
Capillary | SE-54 | 1368. | Harland, Cumming, et al., 1986 | He, 50. C @ 2. min, 8. K/min, 250. C @ 12. min; Column length: 25. m; Column diameter: 0.32 mm |

Normal alkane RI, non-polar column, custom temperature program

Column type | Active phase | I | Reference | Comment |
---|---|---|---|---|
Capillary | Polydimethyl siloxanes | 1349. | Zenkevich and Chupalov, 1996 | Program: not specified |

Normal alkane RI, polar column, custom temperature program

Column type | Active phase | I | Reference | Comment |
---|---|---|---|---|
Capillary | Superox 0.6; Carbowax 20M | 1962. | Waggott and Davies, 1984 | Hydrogen; Column length: 50. m; Column diameter: 0.32 mm; Program: not specified |
Capillary | Carbowax 400, Carbowax 20M, Carbowax 1540, Carbowax 4000, Superox 06, PEG 20M, etc. | 1962. | Waggott and Davies, 1984 | Hydrogen; Column length: 50. m; Column diameter: 0.32 mm; Program: not specified |

Lee's RI, non-polar column, temperature ramp

Column type | Active phase | I | Reference | Comment |
---|---|---|---|---|
Capillary | DB-5MS | 236.62 | Chen, Keeran, et al., 2002 | 30. m/0.25 mm/0.5 μm, 40. C @ 1. min, 10. K/min; Tend: 310. C |
Capillary | DB-5MS | 236.15 | Chen, Keeran, et al., 2002 | 30. m/0.25 mm/0.5 μm, 40. C @ 1. min, 4. K/min; Tend: 310. C |

Lee's RI, non-polar column, custom temperature program

Column type | Active phase | I | Reference | Comment |
---|---|---|---|---|
Capillary | DB-5MS | 236.9 | Aracil, Font, et al., 2005 | Column length: 60. m; Column diameter: 0.25 mm; Program: not specified |

References

Smith, Bjellerup, et al., 1953
Smith, L.; Bjellerup, L.; Krook, S.; Westermark, H.,
Heats of combustion of organic chloro compounds determined by the "quartz wool" method,
Acta Chem. Scand., 1953, 7, 65. [all data]
Costas, Huu, et al., 1988
Costas, M.; Huu, V.T.; Patterson, D.; Caceres-Alonso, M.; Tardajos, G.; Aicart, E.,
Liquid structure and second-order mixing functions for l-chloronaphthalene with linear and branched alkanes, J. Chem. Soc.,
Faraday Trans., 1988, 1 84(5), 1603-1616. [all data]
Wilhelm, Lainez, et al., 1986
Wilhelm, E.; Lainez, A.; Roux, A.H.; Grolier, J.-P.E.,
Excess-molar volumes and heat capacities of (1,2,4-trichlorobenzene + an n-alkane) and (1-chloronaphthalene + an n-alkane),
Thermochim. Acta, 1986, 105, 101-110. [all data]
Grolier, Inglese, et al., 1981
Grolier, J.P.E.; Inglese, A.; Roux, A.H.; Wilhelm, E.,
Thermodynamics of (1-chloronaphthalene + n-alkane): excess enthalpies, excess volumes and excess heat capacities,
Ber. Bunsenges. Phys. Chem., 1981, 85, 768-772. [all data]
Khanna, Khetarpal, et al., 1981
Khanna, M.S.; Khetarpal, S.C.; Lal, K.; Bhatnagar, H.L.,
Thermodynamic studies on melting of some alpha- and beta-halogen derivatives of napthalene,
Indian J. Chem> Sect. A, 1981, 20, 544. [all data]
Bolotnikov and Neruchev, 2006
Bolotnikov, M.F.; Neruchev, Yu.A.,
The enthalpies of vaporization and intermolecular interaction energies of 1-chloroalkanes,
Russ. J. Phys. Chem., 2006, 80, 8, 1191-1197, https://doi.org/10.1134/S0036024406080024
. [all data]
Verevkin, 2003
Verevkin, Sergey P.,
Vapor pressures and enthalpies of vaporization of a series of 1- and 2-halogenated naphthalenes,
The Journal of Chemical Thermodynamics, 2003, 35, 8, 1237-1251, https://doi.org/10.1016/S0021-9614(03)00051-X
. [all data]
Puri, Chickos, et al., 2001
Puri, Swati; Chickos, James S.; Welsh, William J.,
Determination of Vaporization Enthalpies of Polychlorinated Biphenyls by Correlation Gas Chromatography,
Anal. Chem., 2001, 73, 7, 1480-1484, https://doi.org/10.1021/ac001246p
. [all data]
Aldrich Chemical Company Inc., 1990
Aldrich Chemical Company Inc.,
Catalog Handbook of Fine Chemicals, Aldrich Chemical Company, Inc., Milwaukee WI, 1990, 1. [all data]
Lei, Wania, et al., 1999
Lei, Ying Duan; Wania, Frank; Shiu, Wan Ying,
Vapor Pressures of the Polychlorinated Naphthalenes,
J. Chem. Eng. Data, 1999, 44, 3, 577-582, https://doi.org/10.1021/je9802827
. [all data]
Stephenson and Malanowski, 1987
Stephenson, Richard M.; Malanowski, Stanislaw,
Handbook of the Thermodynamics of Organic Compounds, 1987, https://doi.org/10.1007/978-94-009-3173-2
. [all data]
Stull, 1947
Stull, Daniel R.,
Vapor Pressure of Pure Substances. Organic and Inorganic Compounds,
Ind. Eng. Chem., 1947, 39, 4, 517-540, https://doi.org/10.1021/ie50448a022
. [all data]
Acree, 1991
Acree, William E.,
Thermodynamic properties of organic compounds: enthalpy of fusion and melting point temperature compilation,
Thermochimica Acta, 1991, 189, 1, 37-56, https://doi.org/10.1016/0040-6031(91)87098-H
. [all data]
Wenthold and Squires, 1995
Wenthold, P.G.; Squires, R.R.,
Determination of the gas-phase acidities of halogen-substituted aromatic compounds using the silane-cleavage method,
J. Mass Spectrom., 1995, 30, 1, 17, https://doi.org/10.1002/jms.1190300105
. [all data]
Steelhammer and Wentworth, 1969
Steelhammer, J.C.; Wentworth, W.E.,
Correlation of Electron Beam and Thermal Electron Attachment Studies for Some Chloro, Bromo, Iodo Aromatic Compounds,
J. Chem. Phys., 1969, 51, 5, 1802, https://doi.org/10.1063/1.1672262
. [all data]
Klasinc, Kovac, et al., 1983
Klasinc, L.; Kovac, B.; Gusten, H.,
Photoelectron spectra of acenes. Electronic structure and substituent effects,
Pure Appl. Chem., 1983, 55, 289. [all data]