Menthyl acetate

Kovats' RI, non-polar column, isothermal

View large format table.

Column type Active phase Temperature (C) I Reference Comment
CapillarySE-30120.1279.Tudor and Moldovan, 1999
CapillarySE-30100.1279.2Tudor, 199740. m/0.35 mm/0.35 μm
PackedApiezon L150.1255.ter Heide, 1968N2, Embacel; Column length: 2.5 m

Kovats' RI, non-polar column, temperature ramp

View large format table.

Column type Active phase I Reference Comment
CapillaryBP-11285.Srivastava, Ahmad, et al., 200325. m/0.55 mm/0.25 μm, N2, 5. K/min, 220. C @ 15. min; Tstart: 60. C
CapillaryBP-11280.Rao B.R.R., 200225. m/0.5 mm/0.25 μm, 5. K/min, 220. C @ 10. min; Tstart: 60. C
CapillaryOV-1011267.von Poser, Menut, et al., 199625. m/0.25 mm/0.25 μm, N2, 5. K/min; Tstart: 50. C; Tend: 200. C
CapillaryOV-11283.Bicchi, Frattini, et al., 198823. m/0.32 mm/0.3 μm, H2, 3. K/min; Tstart: 50. C; Tend: 200. C

Kovats' RI, non-polar column, custom temperature program

View large format table.

Column type Active phase I Reference Comment
CapillaryBP-11278.Dwivedi, Khan, et al., 200425. m/0.25 mm/0.25 μm, N2; Program: 60C => 5C/min => 220C(5min) => 3C/min => 245C(5min)

Kovats' RI, polar column, isothermal

View large format table.

Column type Active phase Temperature (C) I Reference Comment
PackedCarbowax 20M150.1600.ter Heide, 1968N2, Embacel; Column length: 2.5 m

Kovats' RI, polar column, temperature ramp

View large format table.

Column type Active phase I Reference Comment
CapillarySupelcowax-20M1540.Bicchi, Frattini, et al., 198823. m/0.32 mm/0.30 μm, H2, 50. C @ 1. min, 3. K/min; Tend: 200. C

Van Den Dool and Kratz RI, non-polar column, temperature ramp

View large format table.

Column type Active phase I Reference Comment
CapillaryDB-11294.Dob, Dahmane, et al., 200530. m/0.32 mm/0.25 μm, 50. C @ 8. min, 2. K/min; Tend: 250. C
CapillaryDB-51294.Tampieri, Galuppi, et al., 200330. m/0.25 mm/0.25 μm, He, 3. K/min; Tstart: 60. C; Tend: 240. C
CapillaryDB-51294.Javidnia, Miri, et al., 2002He, 4. K/min; Column length: 25. m; Column diameter: 0.25 mm; Tstart: 70. C; Tend: 275. C
CapillaryCP Sil 5 CB1281.Pino and Marbot, 200150. m/0.32 mm/0.4 μm, He, 60. C @ 10. min, 3. K/min, 280. C @ 60. min
CapillaryBPX-51304.Zabaras and Wyllie, 200150. m/0.22 mm/0.25 μm, H2, 60. C @ 5. min, 4. K/min, 180. C @ 5. min
CapillaryDB-11276.8Tóth and Praszna, 199830. m/0.32 mm/0.32 μm, Ar, 3.9 K/min; Tstart: 60. C; Tend: 210. C
CapillaryDB-11288.2Tóth and Praszna, 199830. m/0.32 mm/0.32 μm, Ar, 3.9 K/min; Tstart: 60. C; Tend: 210. C

Van Den Dool and Kratz RI, non-polar column, custom temperature program

View large format table.

Column type Active phase I Reference Comment
CapillarySE-521294.Mondello, Dugo, et al., 199560. m/0.32 mm/0.40 μm, He; Program: 45 C (6 min) 3 C/min -> 111 0C 2 C/min -> 160 C 3 C/min -> 300 C (15 min)

Van Den Dool and Kratz RI, polar column, temperature ramp

View large format table.

Column type Active phase I Reference Comment
CapillaryFFAP1535.Agnihotri, Agarwal, et al., 200520. m/0.25 mm/0.25 μm, He, 90. C @ 2. min, 4. K/min; Tend: 220. C
CapillaryAT-Wax1551.Pino and Marbot, 200160. m/0.32 mm/0.25 μm, He, 65. C @ 10. min, 2. K/min, 250. C @ 60. min
CapillaryCarbowax 20M1561.Mondello, Dugo, et al., 199560. m/0.32 mm/0.425 μm, He, 45. C @ 3. min, 3. K/min, 300. C @ 20. min

Normal alkane RI, non-polar column, temperature ramp

View large format table.

Column type Active phase I Reference Comment
CapillaryHP-51295.Bertoli, Lepnardi, et al., 201130. m/0.25 mm/0.25 μm, Helium, 3. K/min; Tstart: 60. C; Tend: 240. C
CapillaryHP-5 MS1297.Radulovic, Blagojevic, et al., 201030. m/0.25 mm/0.25 μm, Helium, 5. K/min, 290. C @ 10. min; Tstart: 70. C
CapillaryDB-51300.Baranauskiene R., Bylaite E., et al., 200750. m/0.32 mm/0.25 μm, He, 50. C @ 2. min, 5. K/min, 280. C @ 10. min
CapillaryHP-5MS1294.7Zizovic, Stamenic, et al., 200730. m/0.25 mm/0.25 μm, He, 4. K/min; Tstart: 40. C; Tend: 260. C
CapillaryDB-11281.Tohar, Mohd, et al., 200630. m/0.32 mm/0.25 μm, 60. C @ 3. min, 3. K/min, 230. C @ 10. min
CapillaryMethyl Silicone1302.Tonzibo, Coffy, et al., 200625. m/0.3 mm/0.15 μm, N2, 50. C @ 5. min, 2. K/min; Tend: 210. C
CapillaryPE-51278.Singh, Raina, et al., 200530. m/0.32 mm/0.25 μm, H2, 60. C @ 2. min, 5. K/min, 230. C @ 4. min
CapillaryPE-51310.Singh, Raina, et al., 200530. m/0.32 mm/0.25 μm, H2, 60. C @ 2. min, 5. K/min, 230. C @ 4. min
CapillaryDB-51299.Edris and Farrag, 2003He, 3. K/min; Column length: 60. m; Column diameter: 0.32 mm; Tstart: 50. C; Tend: 220. C
CapillaryOV-1011277.Orav and Kann, 2001He, 2. K/min; Column length: 50. m; Column diameter: 0.2 mm; Tstart: 50. C; Tend: 250. C
CapillaryOV-11279.Oberhofer, Nikiforov, et al., 199925. m/0.25 mm/0.25 μm, H2, 40. C @ 5. min, 3. K/min, 220. C @ 5. min
CapillaryBP-11286.Rao, Bhattacharya, et al., 1999N2, 5. K/min, 220. C @ 10. min; Column length: 25. m; Column diameter: 0.5 mm; Tstart: 60. C
CapillaryDB-51287.Reverchon, Porta, et al., 199730. m/0.25 mm/0.25 μm, He, 50. C @ 5. min, 2. K/min; Tend: 250. C
CapillaryDB-11279.Werkhoff and Güntert, 199760. m/0.32 mm/0.25 μm, He, 3. K/min; Tstart: 60. C; Tend: 220. C

Normal alkane RI, non-polar column, custom temperature program

View large format table.

Column type Active phase I Reference Comment
CapillarySPB-11263.Díaz-Maroto, Castillo, et al., 200750. m/0.25 mm/0.25 μm; Program: 70C(3min) => 4C/min => 120C => 8C/min => 250C(5min)
CapillarySE-521295.Tognolini, Barocelli, et al., 200630. m/0.32 mm/0.15 μm, He; Program: 45C => 1C/min => 100C => 5C/min => 250C (10min)
CapillarySE-301281.Vinogradov, 2004Program: not specified
CapillaryMethyl Silicone1281.Zenkevich, 1999Program: not specified
CapillaryDB-11278.Baratta, Dorman, et al., 199830. m/0.25 mm/0.25 μm, He; Program: 45C => 3C/min => 175C => 15C/min => 240C (10min)
CapillaryDB-51294.Isidorov, Zenkevich, et al., 1997Program: not specified
CapillaryOV-1011281.Shibamoto, 1987Column length: 60. m; Column diameter: 0.25 mm; Program: not specified

Normal alkane RI, polar column, temperature ramp

View large format table.

Column type Active phase I Reference Comment
CapillaryCP-Wax1539.Ka, Choi, et al., 200530. m/0.32 mm/0.25 μm, He, 40. C @ 2. min, 5. K/min; Tend: 180. C
CapillaryPEG-20M1560.Orav and Kann, 2001He, 2. K/min; Column length: 50. m; Column diameter: 0.2 mm; Tstart: 70. C; Tend: 220. C
CapillaryBP-201540.Rao, Bhattacharya, et al., 1999N2, 5. K/min; Column length: 25. m; Column diameter: 0.5 mm; Tstart: 60. C; Tend: 200. C
CapillaryHP-Innowax FSC1574.Baser, Kirimer, et al., 1997He, 60. C @ 10. min, 4. K/min, 240. C @ 10. min; Column length: 60. m; Column diameter: 0.25 mm
CapillaryDB-Wax1563.Werkhoff and Güntert, 199760. m/0.32 mm/0.25 μm, He, 3. K/min; Tstart: 60. C; Tend: 220. C
CapillaryTC-Wax1562.Shuichi, Masazumi, et al., 199680. C @ 5. min, 3. K/min; Column length: 60. m; Column diameter: 0.25 mm; Tend: 240. C

Normal alkane RI, polar column, custom temperature program

View large format table.

Column type Active phase I Reference Comment
CapillaryDB-Wax1556.Wenguang, Wenlai, et al., 200730. m/0.25 mm/0.25 μm; Program: 40 0C (3 min) 3 0C/min -> 150 0C (2 min) 6 0C/min -> 230 0C (10 min)
CapillaryCarbowax 20M1585.Vinogradov, 2004Program: not specified

References

Tudor and Moldovan, 1999
Tudor, E.; Moldovan, D., Temperature Dependence of the Retention Index for Perfumery Compounds on a Se-30 Glass Capillary Column. II. The Hyperbolic Equation, J. Chromatogr., 1999, 848, 1-2, 215-227, https://doi.org/10.1016/S0021-9673(99)00412-4 . [all data]

Tudor, 1997
Tudor, E., Temperature dependence of the retention index for perfumery compounds on a SE-30 glass capillary column. I. Linear equations, J. Chromatogr. A, 1997, 779, 1-2, 287-297, https://doi.org/10.1016/S0021-9673(97)00453-6 . [all data]

ter Heide, 1968
ter Heide, R., Studies on terpenes. II. Characterization of monoterpene esters by gas and thin-layer chromatography, Z. Anal. Chem., 1968, 236, 215-227. [all data]

Srivastava, Ahmad, et al., 2003
Srivastava, S.K.; Ahmad, A.; Syamsunder, K.V.; Aggarwal, K.K.; Shanuja, S.P.S., Essential oil composition of Callistemon viminalis leaves from India, Flavour Fragr. J., 2003, 18, 5, 361-363, https://doi.org/10.1002/ffj.1143 . [all data]

Rao B.R.R., 2002
Rao B.R.R., Biomass yield, essential oil yield and essential oil composition of rose-scented geranium (Pelargonium species) as influenced by row spacings and intercropping with cornmint (Mentha arvensis L.f. piperascens Malinv. ex Holmes), Industrial Crops and Products, 2002, 16, 2, 133-144, https://doi.org/10.1016/S0926-6690(02)00038-9 . [all data]

von Poser, Menut, et al., 1996
von Poser, G.L.; Menut, C.; Toffoli, M.E.; Vérin, P.; Sobral, M.; Bessière, J.-M.; Lamaty, G.; Henriques, A.T., Essential oil composition and allelopathic effect of the Brazilian Lamiaceae Hesperozygis ringens (Benth.) Epling and Hesperozygis rhododon Epling, J. Agric. Food Chem., 1996, 44, 7, 1829-1832, https://doi.org/10.1021/jf950653c . [all data]

Bicchi, Frattini, et al., 1988
Bicchi, C.; Frattini, C.; Nano, G.M.; D'Amato, A., On column injection-dual channel analysis of essential oils, J. Hi. Res. Chromatogr. Chromatogr. Comm., 1988, 11, 1, 56-60, https://doi.org/10.1002/jhrc.1240110115 . [all data]

Dwivedi, Khan, et al., 2004
Dwivedi, S.; Khan, M.; Srivastava, S.K.; Syamasunnder, K.V.; Srivastava, A., Essential oil composition of different accessions of Mentha × piperita L. grown on the northern plains of India, Flavour Fragr. J., 2004, 19, 5, 437-440, https://doi.org/10.1002/ffj.1333 . [all data]

Dob, Dahmane, et al., 2005
Dob, T.; Dahmane, D.; Berramdane, T.; Chelghoum, C., Chemical composition of the essential oil of Artemisia campestris L. from Algeria, Pharm. Biol., 2005, 43, 6, 512-514, https://doi.org/10.1080/13880200500220664 . [all data]

Tampieri, Galuppi, et al., 2003
Tampieri, M.P.; Galuppi, R.; Carelle, M.S.; Macchioni, F.; Cioni, P.L.; Morelli, I., Effect of selected essential oils and pure compounds on Saprolegnia parasitica, Pharm. Biol., 2003, 41, 8, 584-591, https://doi.org/10.1080/13880200390501839 . [all data]

Javidnia, Miri, et al., 2002
Javidnia, K.; Miri, R.; Safavi, F.; Azarpira, A.; Shafiee, A., Composition of the essential oil of Nepeta persica Boiss from Iran, Flavour Fragr. J., 2002, 17, 1, 20-22, https://doi.org/10.1002/ffj.1023 . [all data]

Pino and Marbot, 2001
Pino, J.A.; Marbot, R., Volatile flavor constituents of acerola (Malpighia emarginata DC.) fruit, J. Agric. Food Chem., 2001, 49, 12, 5880-5882, https://doi.org/10.1021/jf010270g . [all data]

Zabaras and Wyllie, 2001
Zabaras, D.; Wyllie, S.G., Quantitative analysis of terpenoids in the gas phase using headspace solid-phase microextraction (HS-SPME), Flavour Fragr. J., 2001, 16, 6, 411-416, https://doi.org/10.1002/ffj.1025 . [all data]

Tóth and Praszna, 1998
Tóth, A.; Praszna, L., Improvement of the reproducibility of retention indices in temperature-programmed gas-liquid chromatography. Part I. DB-1 column, Flavour Fragr. J., 1998, 13, 3, 196-202, https://doi.org/10.1002/(SICI)1099-1026(199805/06)13:3<196::AID-FFJ727>3.0.CO;2-G . [all data]

Mondello, Dugo, et al., 1995
Mondello, L.; Dugo, P.; Basile, A.; Dugo, G., Interactive use of linear retention indices, on polar and apolar columns, with a MS-library for reliable identification of complex mixtures, J. Microcolumn Sep., 1995, 7, 6, 581-591, https://doi.org/10.1002/mcs.1220070605 . [all data]

Agnihotri, Agarwal, et al., 2005
Agnihotri, V.K.; Agarwal, S.G.; Dhar, P.L.; Thappa, R.K.; Baleshwar; Kapahi, B.K.; Saxena, R.K.; Qazi, G.N., Essential oil composition of Mentha pulegium L. growing wild in the north-western Himalayas India, Flavour Fragr. J., 2005, 20, 6, 607-610, https://doi.org/10.1002/ffj.1497 . [all data]

Bertoli, Lepnardi, et al., 2011
Bertoli, A.; Lepnardi, M.; Krzyzanowska, J.; Oleszek, W.; Pistelli, L., Mentha longifolia in vitro cultures as safe source of flavouring ingradients, Acta Biochem. Polonica, 2011, 58, 4, 581-587. [all data]

Radulovic, Blagojevic, et al., 2010
Radulovic, N.; Blagojevic, P.; Palic, R., Comparative study of the leaf volatiles of Arctostaphylos uva-ursi (L.) Spreng. and Vaccinium vitis-idaea L. (Ericaceae), Molecules, 2010, 15, 9, 6168-6185, https://doi.org/10.3390/molecules15096168 . [all data]

Baranauskiene R., Bylaite E., et al., 2007
Baranauskiene R.; Bylaite E.; Venskutonis R.P., Flavor retention of peppermint (Mentha piperita L.) essential oil spray-dried in modified starches during encapsulation and storage, J. Agric. Food Chem., 2007, 55, 8, 3027-3036, https://doi.org/10.1021/jf062508c . [all data]

Zizovic, Stamenic, et al., 2007
Zizovic, I.; Stamenic, M.; Ivanovic, J.; Orlovic, A.; Ristic, M.; Djordjevic, S.; Petrovic, S.D.; Skala, D., Supercritical carbon dioxide extraction of sesquiterpenes from valerian root, J. Supercrit. Fluids, 2007, 43, 2, 249-258, https://doi.org/10.1016/j.supflu.2007.05.007 . [all data]

Tohar, Mohd, et al., 2006
Tohar, N.; Mohd, M.A.; Jantan, I.; Awang, K., A comparative study of the essential oils of the genus Plumeria Linn. from Malaysia, Flavour Fragr. J., 2006, 21, 6, 859-863, https://doi.org/10.1002/ffj.1617 . [all data]

Tonzibo, Coffy, et al., 2006
Tonzibo, Z.F.; Coffy, A.A.; Chalachat, J.C.; N'guessan, Y.T., Chemical composition of essential oils of Hoslundia opposita Vahl. from Ivory Coast., Flavour Fragr. J., 2006, 21, 5, 789-791, https://doi.org/10.1002/ffj.1715 . [all data]

Singh, Raina, et al., 2005
Singh, A.K.; Raina, V.K.; Naqvi, A.A.; Patra, N.K.; Kumar, B.; Ram, P.; Khanuja, S.P.S., Essential oil composition and chemoarrays of menthol mint (Mentha arvensis L. f. piperascens Malinvaud ex. Holmes) cultivars, Flavour Fragr. J., 2005, 20, 3, 302-305, https://doi.org/10.1002/ffj.1417 . [all data]

Edris and Farrag, 2003
Edris, A.E.; Farrag, E.S., Antifungal activity of peppermint and sweet basil essential oils and their major aroma constituents on some plant pathogenic fungi from the vapor phase, Nahrung/Food, 2003, 47, 2, 117-121, https://doi.org/10.1002/food.200390021 . [all data]

Orav and Kann, 2001
Orav, A.; Kann, J., Determination of peppermint and orange aroma compounds in food and beverages, Proc. Est. Acad. Sci. Chem., 2001, 50, 4, 217-225. [all data]

Oberhofer, Nikiforov, et al., 1999
Oberhofer, B.; Nikiforov, A.; Buchbauer, G.; Jirovetz, L.; Bicchi, C., Investigation of the alteration of the composition of various essential oils used in aroma lamp applications, Flavour Fragr. J., 1999, 14, 5, 293-299, https://doi.org/10.1002/(SICI)1099-1026(199909/10)14:5<293::AID-FFJ829>3.0.CO;2-T . [all data]

Rao, Bhattacharya, et al., 1999
Rao, B.R.R.; Bhattacharya, A.K.; Mallavarapu, G.R.; Ramesh, S., Volatile constituents of different parts of cornmint (Mentha arvensis L.), Flavour Fragr. J., 1999, 14, 5, 262-264, https://doi.org/10.1002/(SICI)1099-1026(199909/10)14:5<262::AID-FFJ766>3.0.CO;2-6 . [all data]

Reverchon, Porta, et al., 1997
Reverchon, E.; Porta, G.D.; Gorgoglione, D., Supercritical CO2 extraction of volatile oil from rose concrete, Flavour Fragr. J., 1997, 12, 1, 37-41, https://doi.org/10.1002/(SICI)1099-1026(199701)12:1<37::AID-FFJ605>3.0.CO;2-V . [all data]

Werkhoff and Güntert, 1997
Werkhoff, P.; Güntert, M., Identification of some ester compounds in bourbon vanilla beans, Lebensm. Wiss. Technol., 1997, 30, 4, 429-431, https://doi.org/10.1006/fstl.1996.0194 . [all data]

Díaz-Maroto, Castillo, et al., 2007
Díaz-Maroto, M.C.; Castillo, N.; Castro-Vázquez, L.; González-Viñas, M.A.; Pérez-Coello, M.S., Volatile composition and olfactory profile of pennyroyal (Mentha pulegium L.) plants, Flavour Fragr. J., 2007, 22, 2, 114-118, https://doi.org/10.1002/ffj.1766 . [all data]

Tognolini, Barocelli, et al., 2006
Tognolini, M.; Barocelli, E.; Ballabeni, V.; Bruni, R.; Bianchi, A.; Chiavarini, M.; Impicciatore, M., Comparative screening of plant essential oils: Phenylpropanoid moiety as basic core for antiplatelet activity, Life Sciences, 2006, 78, 13, 1419-1432, https://doi.org/10.1016/j.lfs.2005.07.020 . [all data]

Vinogradov, 2004
Vinogradov, B.A., Production, composition, properties and application of essential oils, 2004, retrieved from http://viness.narod.ru. [all data]

Zenkevich, 1999
Zenkevich, I.G., Analytical Parameters of Components of essential Oils for their Gas Chromatographic and Chromato-Mass-Spectral Identification. Acetates of Terpene Alcohols, Rastitelnye Resursy (Plant Resources), 1999, 35, 1, 30-37. [all data]

Baratta, Dorman, et al., 1998
Baratta, M.T.; Dorman, H.J.; Deans, S.G.; Figueiredo, A.C.; Barroso, J.G.; Ruberto, G., Antimicrobial and antioxidant properties of some commercial essential oils, Flavour Fragr. J., 1998, 13, 4, 235-244, https://doi.org/10.1002/(SICI)1099-1026(1998070)13:4<235::AID-FFJ733>3.0.CO;2-T . [all data]

Isidorov, Zenkevich, et al., 1997
Isidorov, V.; Zenkevich, I.; Sacharevich, T., Calculation of Gas Chromatographic Retention Indices for Monoterpenes and Terpenoids from Their Physico-Chemical Constants, Chem. Anal. (Warsaw), 1997, 42, 627-634. [all data]

Shibamoto, 1987
Shibamoto, T., Retention Indices in Essential Oil Analysis in Capillary Gas Chromatography in Essential Oil Analysis, Sandra, P.; Bicchi, C., ed(s)., Hutchig Verlag, Heidelberg, New York, 1987, 259-274. [all data]

Ka, Choi, et al., 2005
Ka, M.-H.; Choi, E.H.; Chun, H.-S.; Lee, K.-G., Antioxidative Activity of Volatile Extracts Isolated from Angelica tenuissimae Roots, Peppermint Leaves, Pine Needles, and Sweet Flag Leaves, J. Agric. Food Chem., 2005, 53, 10, 4124-4129, https://doi.org/10.1021/jf047932x . [all data]

Baser, Kirimer, et al., 1997
Baser, K.H.C.; Kirimer, N.; Duman, H., Composition of the essential oil of Micromeria dolichodontha P. H. Davis, Flavour Fragr. J., 1997, 12, 4, 289-291, https://doi.org/10.1002/(SICI)1099-1026(199707)12:4<289::AID-FFJ640>3.0.CO;2-A . [all data]

Shuichi, Masazumi, et al., 1996
Shuichi, H.; Masazumi, N.; Hiromu, K.; Kiyoshi, F., Comparison of volatile compounds berween the crude drugs, Onji-tsutsu and Onji-niki, Nippon nogei kagaku kaishi, 1996, 70, 2, 151-160. [all data]

Wenguang, Wenlai, et al., 2007
Wenguang, J.; Wenlai, F.; Yan, X.; Guangao, Z.; Jiming, L.; Ying, Y., Analysis of free terpenoids in four Vitis vinifera varietis using solvent assisted flavour evaporation and gas chromatography-tandem mass spectrometry, Chinese J. Chromatogr., 2007, 25, 6, 881-886, https://doi.org/10.1016/S1872-2059(08)60006-1 . [all data]