triphenyltin hydride
- Formula: C18H16Sn
- Molecular weight: 351.030
- IUPAC Standard InChIKey: NFHRNKANAAGQOH-UHFFFAOYSA-N
- CAS Registry Number: 892-20-6
- Chemical structure:
View 3d structure (requires JavaScript / HTML 5) - Permanent link for this species. Use this link for bookmarking this species for future reference.

Gas phase ion energetics data

Data compiled by: Sharon G. Lias, Rhoda D. Levin, and Sherif A. Kafafi
Ionization energy determinations
IE (eV) | Method | Reference | Comment |
---|---|---|---|
9.11 ± 0.05 | PE | Distefano, Pignataro, et al., 1976 | Vertical value |

References

Distefano, Pignataro, et al., 1976
Distefano, G.; Pignataro, S.; Szepes, L.; Borossay, J.,
Photoelectron spectroscopy study of the triphenyl derivatives of the group IV elements,
J. Organomet. Chem., 1976, 104, 173. [all data]