Trimethyldiphosphinyl radical
- Formula: C3H9P2
- Molecular weight: 107.0511
- IUPAC Standard InChIKey: RGQRPRRPSJHKNO-UHFFFAOYSA-N
- CAS Registry Number: 89148-95-8
- Chemical structure:
View 3d structure (requires JavaScript / HTML 5) - Permanent link for this species. Use this link for bookmarking this species for future reference.

Gas phase ion energetics data

Data compiled by: Henry M. Rosenstock, Keith Draxl, Bruce W. Steiner, and John T. Herron
Ionization energy determinations
IE (eV) | Method | Reference |
---|---|---|
7.9 | EI | Bogolyubov, Grishin, et al., 1969 |

References

Bogolyubov, Grishin, et al., 1969
Bogolyubov, G.M.; Grishin, N.N.; Petrov, A.A.,
Organic derivatives of group V and group VI elements. VIII.Mass spectra of phosphines and diphosphines,
Zh. Obshch. Khim., 1969, 39, 1808, In original 1772. [all data]