1-[(4-Bromophenyl)methyl]pyridinium
- Formula: C12H11BrN
- Molecular weight: 249.126
- IUPAC Standard InChIKey: LADMUUSDJBIFDI-UHFFFAOYSA-N
- CAS Registry Number: 89047-29-0
- Chemical structure:
View 3d structure (requires JavaScript / HTML 5) - Permanent link for this species. Use this link for bookmarking this species for future reference.

Gas phase ion energetics data

Data compiled by: Sharon G. Lias and Joel F. Liebman
Appearance energy determinations
Ion | AE (eV) | Other Products | Method | Reference | Comment |
---|---|---|---|---|---|
C7H6Br+[4-BrC6H4CH2+] | 1.4 ± 0.35 | C5H5N | CAD | Katritzky, Watson, et al., 1990 |

References

Katritzky, Watson, et al., 1990
Katritzky, A.R.; Watson, C.H.; Dega-Szafran, Z.; Eyler, J.R.,
Collisionally activated dissociation of N-alkylpyridinium cations to pyridine and alkyl cations in the gas phase,
J. Am. Chem. Soc., 1990, 112, 2471. [all data]