1,2,4-Oxadiazole, 3,5-diphenyl-
- Formula: C14H10N2O
- Molecular weight: 222.2420
- IUPAC Standard InChIKey: VIZNDSYPXQJMCM-UHFFFAOYSA-N
- CAS Registry Number: 888-71-1
- Chemical structure:
View 3d structure (requires JavaScript / HTML 5) - Other names: 3,5-Diphenyl-1,2,4-oxadiazole

Condensed phase thermochemistry data

Data compiled by: Hussein Y. Afeefy, Joel F. Liebman, and Stephen E. Stein
Quantity | Value | Units | Method | Reference | Comment |
---|---|---|---|---|---|
ΔcH°solid | -7145. ± 11. | kJ/mol | Ccb | Milone and Allavena, 1931 | Reanalyzed by Cox and Pilcher, 1970, Original value = -7146. kJ/mol |

Phase change data

Data compiled by: Robert L. Brown and Stephen E. Stein
Reduced pressure boiling point
Tboil (K) | Pressure (bar) | Reference |
---|---|---|
483.2 | 0.023 | Weast and Grasselli, 1989 |

Gas phase ion energetics data

Data compiled by: Henry M. Rosenstock, Keith Draxl, Bruce W. Steiner, and John T. Herron
Ionization energy determinations
IE (eV) | Method | Reference |
---|---|---|
9.2 ± 0.1 | EI | Cotter, 1964 |
Appearance energy determinations
Ion | AE (eV) | Other Products | Method | Reference | Comment |
---|---|---|---|---|---|
C7H5N+ | 10.2 ± 0.1 | ? | EI | Cotter, 1964 | |
C7H5NO+ | 10.8 ± 0.1 | ? | EI | Cotter, 1964 |

References

Milone and Allavena, 1931
Milone, M.; Allavena, S.,
Sul calore di combustione di alcuni composti eterociclici,
Gazz. Chim. Ital., 1931, 61, 75-90. [all data]
Cox and Pilcher, 1970
Cox, J.D.; Pilcher, G.,
Thermochemistry of Organic and Organometallic Compounds, Academic Press, New York, 1970, 1-636. [all data]
Weast and Grasselli, 1989
CRC Handbook of Data on Organic Compounds, 2nd Editon, Weast,R.C and Grasselli, J.G., ed(s)., CRC Press, Inc., Boca Raton, FL, 1989, 1. [all data]
Cotter, 1964
Cotter, J.L.,
Electron-impact fragmentation patterns of 3,5-diphenyl-1,2,4-oxadiazole and 2,5-diphenyl-1,3,4-oxadiazole,
J. Chem. Soc., 1964, 5491. [all data]