Benzene, 1,1'-(1,3-butadiyne-1,4-diyl)bis-
- Formula: C16H10
- Molecular weight: 202.2506
- IUPAC Standard InChIKey: HMQFJYLWNWIYKQ-UHFFFAOYSA-N
- CAS Registry Number: 886-66-8
- Chemical structure:
View 3d structure (requires JavaScript / HTML 5) - Other names: Butadiyne, diphenyl-; Diphenyl-1,3-butadiyne; Diphenylbutadiyne; Diphenyldiacetylene; 1,4-Diphenyl-1,3-butadiyne; 1,4-Diphenylbutadiyne; 1,4-Diphenylbut-1,3-diyne; Diphenylbiacetylene; NSC 529170; 1,1'-(1,3-butadiyne-1,4-diyl)bisbenzene

Condensed phase thermochemistry data

Data compiled by: Hussein Y. Afeefy, Joel F. Liebman, and Stephen E. Stein
Quantity | Value | Units | Method | Reference | Comment |
---|---|---|---|---|---|
ΔcH°solid | -8243. ± 1. | kJ/mol | Ccb | Coops, Hoijtink, et al., 1953 | Corresponding ΔfHºsolid = 518. kJ/mol (simple calculation by NIST; no Washburn corrections) |
ΔcH°solid | -8266.2 ± 1.7 | kJ/mol | Ccb | Ott, 1928 | Corresponding ΔfHºsolid = 540.95 kJ/mol (simple calculation by NIST; no Washburn corrections) |

Phase change data

Data compiled by: Thermodynamics Research Center, NIST Boulder Laboratories, Chris Muzny director
Quantity | Value | Units | Method | Reference | Comment |
---|---|---|---|---|---|
Tfus | 359.9 | K | N/A | Grignard and Tcheoufaki, 1929 | Uncertainty assigned by TRC = 2. K |

Reaction thermochemistry data

Data compiled by: Hussein Y. Afeefy, Joel F. Liebman, and Stephen E. Stein
Individual Reactions
By formula: 4H2 + C16H10 = C16H18
Quantity | Value | Units | Method | Reference | Comment |
---|---|---|---|---|---|
ΔrH° | -495.8 ± 4.1 | kJ/mol | Chyd | Davis, Allinger, et al., 1985 | liquid phase; solvent: Hexane |

Gas phase ion energetics data

Data compiled by: Sharon G. Lias, Rhoda D. Levin, and Sherif A. Kafafi
Ionization energy determinations
IE (eV) | Method | Reference | Comment |
---|---|---|---|
7.90 ± 0.08 | PE | Elbel, Lienert, et al., 1981 | |
7.8 | PE | Andreocci, Bicev, et al., 1980 | |
8.23 | PE | Andreocci, Bicev, et al., 1980 | Vertical value |

References

Coops, Hoijtink, et al., 1953
Coops, J.; Hoijtink, G.J.; Kramer, Th.J.E.; Faber, A.C.,
Thermochemical investigations on arylethynes I. Heats of combustion of some diarylethynes,
Rec. Trav. Chim. Pays/Bas, 1953, 72, 781. [all data]
Ott, 1928
Ott, E.,
Nachtrage zu der Untersuchung uber die Habhydrierung der Acetylen-Binding und die Abhangigkeit der Konfiguration der entstehenden Athylen-Verbin-dungen von der Reaktionsgeschwindigkeit,
Ber., 1928, 61, 2119-2123. [all data]
Grignard and Tcheoufaki, 1929
Grignard, V.; Tcheoufaki,
The α-Diacetylenic Hydrocarbons,
C. R. Hebd. Seances Acad. Sci., 1929, 188, 357. [all data]
Davis, Allinger, et al., 1985
Davis, H.E.; Allinger, N.L.; Rogers, D.W.,
Enthalpies of hydrogenation of phenylalkynes: indirect determination of the enthalpy of formation of diphenylcyclopropenone,
J. Org. Chem., 1985, 50, 3601-3604. [all data]
Elbel, Lienert, et al., 1981
Elbel, S.; Lienert, K.; Krebs, A.; tom Dieck, H.,
Phenylethin - mustersonde fur substituenteneffekte,
Liebigs Ann. Chem., 1981, 1785. [all data]
Andreocci, Bicev, et al., 1980
Andreocci, M.V.; Bicev, P.; Cauletti, C.; Piancastelli, M.N.,
The electronic structure of the .PI.-systems of acetylenic oligomers and related substances: An UPS study of diphenylbutadiyne and diphenylbutenyne,
Gazz. Chim. Ital., 1980, 110, 31. [all data]