1,4-Diphenyl-1,3-butadiene
- Formula: C16H14
- Molecular weight: 206.2824
- IUPAC Standard InChIKey: JFLKFZNIIQFQBS-UHFFFAOYSA-N
- CAS Registry Number: 886-65-7
- Chemical structure:
View 3d structure (requires JavaScript / HTML 5) - Stereoisomers:
- Other names: Benzene, 1,1'-(1,3-butadiene-1,4-diyl)bis-; 1,3-Butadiene, 1,4-diphenyl-; Bistyryl; Distyryl; 1,4-Diphenylbutadiene; 1,4-Diphenylerythrene; (4-Phenyl-1,3-butadienyl)benzene; NSC 122702; 1,4-diphenylbuta-1,3-diene

Phase change data

Data compiled by: Thermodynamics Research Center, NIST Boulder Laboratories, Chris Muzny director
Quantity | Value | Units | Method | Reference | Comment |
---|---|---|---|---|---|
Tfus | 425.9 | K | N/A | Sangster and Irvine, 1956 | Uncertainty assigned by TRC = 3. K |
Tfus | 425. | K | N/A | Ziegler, Eimers, et al., 1950 | Uncertainty assigned by TRC = 5. K |

Gas phase ion energetics data

Data compiled as indicated in comments:
LLK - Sharon G. Lias, Rhoda D. Levin, and Sherif A. Kafafi
RDSH - Henry M. Rosenstock, Keith Draxl, Bruce W. Steiner, and John T. Herron
B - John E. Bartmess
Electron affinity determinations
EA (eV) | Method | Reference | Comment |
---|---|---|---|
0.670 ± 0.020 | LPES | Vogeler, Siegert, et al., 2011 | B |
Ionization energy determinations
IE (eV) | Method | Reference | Comment |
---|---|---|---|
8.05 | PE | Rucker, Lang, et al., 1980 | LLK |
7.56 | PE | Hudson, Ridyard, et al., 1976 | LLK |
7.75 | CTS | Briegleb and Czekalla, 1959 | RDSH |
7.54 ± 0.03 | PE | Klessinger and Gunkel, 1978 | Vertical value; LLK |

Normal alkane RI, non-polar column, custom temperature program

Column type | Active phase | I | Reference | Comment |
---|---|---|---|---|
Capillary | DB-1 | 1738. | Hathcock and Bertsch, 1993 | 100. m/0.25 mm/0.5 μm; Program: not specified |

References

Sangster and Irvine, 1956
Sangster, R.C.; Irvine, J.W.,
Study of Organic Scintillators,
J. Chem. Phys., 1956, 24, 670. [all data]
Ziegler, Eimers, et al., 1950
Ziegler, K.; Eimers, E.; Hechelhammer, W.; Wilms, H.,
Butadiene and Its Polymerization,
Justus Liebigs Ann. Chem., 1950, 567, 43-96. [all data]
Vogeler, Siegert, et al., 2011
Vogeler, F.; Siegert, S.; Marian, C.M.; Weinkauf, R.,
T-1, T-2 State Energies and Electron Affinities of Small alpha,omega-Diphenylpolyenes Investigated by Anion Photodetachment Photoelectron Spectroscopy and Excited-State Theory,
Chemphyschem, 2011, 12, 10, 1948-1956, https://doi.org/10.1002/cphc.201001083
. [all data]
Rucker, Lang, et al., 1980
Rucker, C.; Lang, D.; Sauer, J.; Friege, H.; Sustmann, R.,
Reaktivitat substituierter 1,3-Butadiene in Diels-Alder-Reaktionen,
Chem. Ber., 1980, 113, 1663. [all data]
Hudson, Ridyard, et al., 1976
Hudson, B.S.; Ridyard, J.N.A.; Diamond, J.,
Polyene spectroscopy. Photoelectron spectra of the diphenylpolyenes,
J. Am. Chem. Soc., 1976, 98, 1126. [all data]
Briegleb and Czekalla, 1959
Briegleb, G.; Czekalla, J.,
Die Bestimmung von lonisierungsenergien aus den Spektren von Elektronenubergangskomplexen,
Z.Elektrochem., 1959, 63, 6. [all data]
Klessinger and Gunkel, 1978
Klessinger, M.; Gunkel, E.,
The electronic structure of polyenes and unsaturated carbonyl compounds,
Tetrahedron, 1978, 34, 3591. [all data]
Hathcock and Bertsch, 1993
Hathcock, S.; Bertsch, W.,
Analysis of volatiles associated with industrial scale processing of expanded polystyrene. Part II: Identification and quantitation,
J. Hi. Res. Chromatogr., 1993, 16, 11, 651-659, https://doi.org/10.1002/jhrc.1240161106
. [all data]