1H-Benzotriazole, 1-phenyl-
- Formula: C12H9N3
- Molecular weight: 195.2200
- IUPAC Standard InChIKey: ZBJLUVHQIPUCPM-UHFFFAOYSA-N
- CAS Registry Number: 883-39-6
- Chemical structure:
View 3d structure (requires JavaScript / HTML 5) - Other names: 1-Phenyl-1,2,3-benzotriazole; 1-Phenylbenzotriazole

Gas phase ion energetics data

Data compiled by: Henry M. Rosenstock, Keith Draxl, Bruce W. Steiner, and John T. Herron
Appearance energy determinations
Ion | AE (eV) | Other Products | Method | Reference | Comment |
---|---|---|---|---|---|
C12H9N+ | 9.7 ± 0.1 | N2 | EI | Rapp, Staab, et al., 1970 |

References

Rapp, Staab, et al., 1970
Rapp, U.; Staab, H.A.; Wunsche, C.,
Skelettumlagerungen unter Elektronenbeschuss-IV: zur Struktur der C13H9- und C12H9N-Ionen bei Benzylidenaminobenztriazolen,
Org. Mass Spectrom., 1970, 3, 45. [all data]