Phenanthrene, 9-methyl-
- Formula: C15H12
- Molecular weight: 192.2558
- IUPAC Standard InChIKey: DALBHIYZSZZWBS-UHFFFAOYSA-N
- CAS Registry Number: 883-20-5
- Chemical structure:
View 3d structure (requires JavaScript / HTML 5) - Other names: 9-Methylphenanthrene

Gas phase ion energetics data

Data compiled as indicated in comments:
RDSH - Henry M. Rosenstock, Keith Draxl, Bruce W. Steiner, and John T. Herron
Ionization energy determinations
IE (eV) | Method | Reference | Comment |
---|---|---|---|
7.46 ± 0.03 | EI | Bonnier, Gelus, et al., 1965 | RDSH |
Appearance energy determinations
Ion | AE (eV) | Other Products | Method | Reference | Comment |
---|---|---|---|---|---|
C15H9+ | 16.5 ± 0.2 | H2+H | EI | Nounou, 1966 | RDSH |
C15H10+ | 13.3 ± 0.2 | H2 | EI | Nounou, 1966 | RDSH |
C15H11+ | 12.4 ± 0.1 | H | EI | Nounou, 1966 | RDSH |

Kovats' RI, non-polar column, isothermal

View large format table.

Column type Active phase Temperature (C) I Reference Comment
PackedOV-101230.1959.Grimmer and Böhnke, 1975Gas Chrom Q; Column length: 10. m
CapillaryOV-101230.1959.Grimmer and Böhnke, 1972N2; Column length: 50. m; Column diameter: 0.50 mm

Normal alkane RI, non-polar column, custom temperature program

View large format table.

Column type Active phase I Reference Comment
PackedOV-1011959.Kaliszan and Lamparczyk, 1978Program: not specified

Lee's RI, non-polar column, temperature ramp

View large format table.

Column type Active phase I Reference Comment
CapillaryDB-5MS322.65Sun, Zhou, et al., 200830. m/0.25 mm/0.25 μm, 50. C @ 2. min, 6. K/min, 300. C @ 16. min
Capillary5 % Phenyl methyl siloxane323.06Skrbic and Onjia, 20062. K/min; Tstart: 50. C; Tend: 250. C
Capillary5 % Phenyl methyl siloxane319.20Skrbic and Onjia, 200680. C @ 2. min, 8. K/min, 300. C @ 10. min
CapillaryHP-5322.92Pedersen, Durant, et al., 200530. m/0.25 mm/0.25 μm, Helium, 50. C @ 1.5 min, 6. K/min, 310. C @ 10. min
CapillaryHP-5322.78Marynowski, Pieta, et al., 200460. m/0.25 mm/0.25 μm, He, 3. K/min; Tstart: 35. C; Tend: 300. C
CapillaryPTE-5323.28Wang, Jia, et al., 200030. m/0.25 mm/0.25 μm, 60. C @ 1.5 min, 8. K/min, 300. C @ 12.5 min
CapillaryPTE-5324.71Wang, Jia, et al., 200030. m/0.25 mm/0.25 μm, 60. C @ 1.5 min, 8. K/min, 300. C @ 12.5 min
CapillaryHP-5322.61Piao, Chu, et al., 199930. m/0.25 mm/0.25 μm, 50. C @ 2. min, 4. K/min, 280. C @ 20. min
CapillaryDB-5323.24Williams and Horne, 1995He, 60. C @ 2. min, 5. K/min; Column length: 25. m; Column diameter: 0.3 mm; Tend: 270. C
CapillaryDB-5322.90Wang, Fingas, et al., 199430. m/0.32 mm/0.25 μm, He, 50. C @ 2. min, 6. K/min; Tend: 300. C
CapillaryCP Sil 8 CB323.1Bundt, Herbel, et al., 199150. m/0.25 mm/0.25 μm, He, 4. K/min; Tstart: 80. C; Tend: 300. C
CapillaryDB-5322.86Tong, Centen, et al., 1985He, 4. K/min; Column length: 30. m; Column diameter: 0.25 mm; Tstart: 90. C; Tend: 325. C
CapillarySE-52322.81Vassilaros, Kong, et al., 198220. m/0.30 mm/0.25 μm, H2, 40. C @ 2. min, 4. K/min; Tend: 265. C
CapillarySE-52323.06Lee, Vassilaros, et al., 197912. m/0.3 mm/0.34 μm, He, 2. K/min; Tstart: 50. C; Tend: 250. C

Lee's RI, non-polar column, custom temperature program

View large format table.

Column type Active phase I Reference Comment
CapillaryHP-5MS322.74Wang, Li, et al., 200730. m/0.25 mm/0.25 μm, He; Program: 60C(2min) => 6C/min => 258C => 2C/min => 300C(4min)
CapillaryHP-5MS322.74Wang, Li, et al., 2007, 230. m/0.25 mm/0.25 μm, He; Program: not specified
CapillaryHP-5MS322.78Wang, Li, et al., 2007, 230. m/0.25 mm/0.25 μm, He; Program: not specified
CapillaryHP-5MS322.90Wang, Li, et al., 2007, 230. m/0.25 mm/0.25 μm, He; Program: not specified
CapillaryUltra-1319.2Sremac, Skrbic, et al., 200550. m/0.32 mm/0.50 μm, Nitrogen; Program: 40-100 0C 3-15 0C/min -> 290 0C
CapillaryUltra-1323.1Sremac, Skrbic, et al., 200550. m/0.32 mm/0.50 μm, Nitrogen; Program: 40-100 0C 3-15 0C/min -> 290 0C
CapillaryDB-5322.8Lundstedt, Haglund, et al., 200330. m/0.25 mm/0.25 μm; Program: not specified
CapillaryDB-5323.1Paschke, Herbel, et al., 199230. m/0.25 mm/0.25 μm, He; Program: 60 0C (3 min) 10 0C/min -> 100 0C (3 min) 5 0C/min -> 300 0C
CapillaryCP Sil 8 CB322.8Bundt, Herbel, et al., 199150. m/0.25 mm/0.25 μm, He; Program: not specified
CapillaryCP Sil 8 CB323.3Bundt, Herbel, et al., 199150. m/0.25 mm/0.25 μm, He; Program: not specified
CapillaryDB-5319.17Takada, Onda, et al., 1990He; Program: 70C(2min) => 30C/min => 150C => 5C/min => 200C => 4C/min => 310C
CapillaryDB-5323.06Naikwadi, Charbonneau, et al., 1987Column length: 30. m; Column diameter: 0.32 mm; Program: not specified
CapillaryDB-5323.78Naikwadi, Charbonneau, et al., 1987Column length: 30. m; Column diameter: 0.32 mm; Program: not specified
CapillaryDB-5323.06Tong, Centen, et al., 1985He; Column length: 30. m; Column diameter: 0.25 mm; Program: not specified
CapillarySE-52323.06Shlyakhov, 1984Program: not specified

References

Bonnier, Gelus, et al., 1965
Bonnier, J.-M.; Gelus, M.; Nounou, P.,
Contribution a l'etude de l'effet inductif et de l'effet d'hyperconjugaison dans quelques methylaromatiques,
J. Chim. Phys., 1965, 10, 1191. [all data]
Nounou, 1966
Nounou, P.,
Etude des composes aromatiques par spectrometrie de masse. I. Mesure des potentials d'ionisation et d'apparition par la methode du potential retardateur et interpretation des courbes d'ionisation differentielle,
J. Chim. Phys., 1966, 63, 994. [all data]