Benzene, 1-chloro-2-(trifluoromethyl)-
- Formula: C7H4ClF3
- Molecular weight: 180.555
- IUPAC Standard InChIKey: DGRVQOKCSKDWIH-UHFFFAOYSA-N
- CAS Registry Number: 88-16-4
- Chemical structure:
View 3d structure (requires JavaScript / HTML 5) - Other names: 2-Chloro-benzotrifluoride; o-Chlorobenzotrifluoride; o-(Trifluoromethyl)chlorobenzene; o-(Trifluoromethyl)phenyl chloride; o-Chloro-α,α,α-trifluorotoluene; Toluene, o-chloro-α,α,α-trifluoro-; 1-Chloro-2-(trifluoromethyl)benzene; 2-Chloro(trifluoromethyl)benzene; NSC 10307; 2-(Trifluoromethyl)chlorobenzene; 2-Chloro-α,α,α-trifluorotoluene

Phase change data

Data compiled as indicated in comments:
BS - Robert L. Brown and Stephen E. Stein
AC - William E. Acree, Jr., James S. Chickos
Quantity | Value | Units | Method | Reference | Comment |
---|---|---|---|---|---|
Tboil | 425.4 | K | N/A | Weast and Grasselli, 1989 | BS |
Enthalpy of vaporization
ΔvapH (kJ/mol) | Temperature (K) | Method | Reference | Comment |
---|---|---|---|---|
44.6 | 325. | A | Stephenson and Malanowski, 1987 | Based on data from 310. to 426. K. See also Potter and Saylor, 1951, Dykyj and Vanko, 1970, and Kkykj and Repas, 1973.; AC |
Antoine Equation Parameters
log10(P) = A − (B / (T + C))
P = vapor pressure (bar)
T = temperature (K)
View plot Requires a JavaScript / HTML 5 canvas capable browser.
Temperature (K) | A | B | C | Reference | Comment |
---|---|---|---|---|---|
273. to 425.4 | 4.45125 | 1726.811 | -37.352 | Stull, 1947 | Coefficents calculated by NIST from author's data. |
Enthalpy of fusion
ΔfusH (kJ/mol) | Temperature (K) | Method | Reference | Comment |
---|---|---|---|---|
11.6 | 264. | DSC | Ahmed and Eades, 1972 | AC |

Gas phase ion energetics data

Data compiled by: Sharon G. Lias, Rhoda D. Levin, and Sherif A. Kafafi
Ionization energy determinations
IE (eV) | Method | Reference | Comment |
---|---|---|---|
9.47 | PE | Gounelle, Jullien, et al., 1975 | Vertical value |

Van Den Dool and Kratz RI, non-polar column, temperature ramp

Column type | Active phase | I | Reference | Comment |
---|---|---|---|---|
Capillary | OV-1 | 883.4 | Gautzsch and Zinn, 1996 | 8. K/min; Tstart: 35. C; Tend: 300. C |
Capillary | OV-1 | 883.4 | Gautzsch and Zinn, 1996 | 8. K/min; Tstart: 35. C; Tend: 300. C |

References

Weast and Grasselli, 1989
CRC Handbook of Data on Organic Compounds, 2nd Editon, Weast,R.C and Grasselli, J.G., ed(s)., CRC Press, Inc., Boca Raton, FL, 1989, 1. [all data]
Stephenson and Malanowski, 1987
Stephenson, Richard M.; Malanowski, Stanislaw,
Handbook of the Thermodynamics of Organic Compounds, 1987, https://doi.org/10.1007/978-94-009-3173-2
. [all data]
Potter and Saylor, 1951
Potter, John C.; Saylor, John H.,
The Vapor Pressures and Freezing Points of Some Organic Fluorine Compounds 1,2,
J. Am. Chem. Soc., 1951, 73, 1, 90-91, https://doi.org/10.1021/ja01145a032
. [all data]
Dykyj and Vanko, 1970
Dykyj, J.; Vanko, A.,
Petrochemica, 1970, 10, 1, 3. [all data]
Kkykj and Repas, 1973
Kkykj, J.; Repas, M.,
Petrochemia, 1973, 13, 179. [all data]
Stull, 1947
Stull, Daniel R.,
Vapor Pressure of Pure Substances. Organic and Inorganic Compounds,
Ind. Eng. Chem., 1947, 39, 4, 517-540, https://doi.org/10.1021/ie50448a022
. [all data]
Ahmed and Eades, 1972
Ahmed, A.M.I.; Eades, R.G.,
Proton magnetic relaxation in toluene and some derivatives,
J. Chem. Soc., Faraday Trans. 2, 1972, 68, 1623, https://doi.org/10.1039/f29726801623
. [all data]
Gounelle, Jullien, et al., 1975
Gounelle, Y.; Jullien, J.; Solgadi, D.; Botter, R.; Menes, F.,
No. 157. - Effets de l'isomerie sur les potentiels d'ionisation: Spectres des photoelectrons de dihalogeno-benzenes,
J. Chim. Phys., 1975, 10, 1094. [all data]
Gautzsch and Zinn, 1996
Gautzsch, R.; Zinn, P.,
Use of incremental models to estimate the retention indexes of aromatic compounds,
Chromatographia, 1996, 43, 3/4, 163-176, https://doi.org/10.1007/BF02292946
. [all data]