Benzene, pentafluoronitro-
- Formula: C6F5NO2
- Molecular weight: 213.0617
- IUPAC Standard InChIKey: INUOFQAJCYUOJR-UHFFFAOYSA-N
- CAS Registry Number: 880-78-4
- Chemical structure:
View 3d structure (requires JavaScript / HTML 5) - Other names: Nitropentafluorobenzene; Pentafluoronitrobenzene; 1,2,3,4,5-Pentafluoro-6-nitrobenzene

Condensed phase thermochemistry data

Data compiled by: Eugene S. Domalski and Elizabeth D. Hearing
Quantity | Value | Units | Method | Reference | Comment |
---|---|---|---|---|---|
S°liquid | 323.13 | J/mol*K | N/A | Paukov, 1971 |
Constant pressure heat capacity of liquid
Cp,liquid (J/mol*K) | Temperature (K) | Reference | Comment |
---|---|---|---|
272.96 | 298.15 | Paukov, 1971 | T = 12 to 300 K. |

Phase change data

Data compiled as indicated in comments:
BS - Robert L. Brown and Stephen E. Stein
TRC - Thermodynamics Research Center, NIST Boulder Laboratories, Chris Muzny director
DH - Eugene S. Domalski and Elizabeth D. Hearing
AC - William E. Acree, Jr., James S. Chickos
Quantity | Value | Units | Method | Reference | Comment |
---|---|---|---|---|---|
Tboil | 432.7 | K | N/A | Aldrich Chemical Company Inc., 1990 | BS |
Quantity | Value | Units | Method | Reference | Comment |
Ttriple | 250.5 | K | N/A | Paukov, 1971, 2 | Uncertainty assigned by TRC = 0.2 K; TRC |
Enthalpy of fusion
ΔfusH (kJ/mol) | Temperature (K) | Reference | Comment |
---|---|---|---|
11.807 | 250.5 | Paukov, 1971 | DH |
11.81 | 250.5 | Domalski and Hearing, 1996 | AC |
Entropy of fusion
ΔfusS (J/mol*K) | Temperature (K) | Reference | Comment |
---|---|---|---|
47.13 | 250.5 | Paukov, 1971 | DH |

Reaction thermochemistry data

Data compiled as indicated in comments:
B - John E. Bartmess
M - Michael M. Meot-Ner (Mautner) and Sharon G. Lias
Individual Reactions
By formula: F- + C6F5NO2 = (F- • C6F5NO2)
Quantity | Value | Units | Method | Reference | Comment |
---|---|---|---|---|---|
ΔrH° | 172. ± 8.4 | kJ/mol | IMRE | Dillow and Kebarle, 1988 | gas phase; Anchored to C6F6..F- in Hiraoka, Mizuse, et al., 1987; B,M |
Quantity | Value | Units | Method | Reference | Comment |
ΔrS° | 82.0 | J/mol*K | N/A | Dillow and Kebarle, 1988 | gas phase; switching reaction,Thermochemical ladder(F-)C6F6, Entropy change calculated or estimated; Hiraoka, Mizuse, et al., 1987; M |
Quantity | Value | Units | Method | Reference | Comment |
ΔrG° | 137. ± 8.4 | kJ/mol | IMRE | Dillow and Kebarle, 1988 | gas phase; Anchored to C6F6..F- in Hiraoka, Mizuse, et al., 1987; B |
Free energy of reaction
ΔrG° (kJ/mol) | T (K) | Method | Reference | Comment |
---|---|---|---|---|
137. | 423. | PHPMS | Dillow and Kebarle, 1988 | gas phase; switching reaction,Thermochemical ladder(F-)C6F6, Entropy change calculated or estimated; Hiraoka, Mizuse, et al., 1987; M |

Gas phase ion energetics data

Data compiled as indicated in comments:
LL - Sharon G. Lias and Joel F. Liebman
B - John E. Bartmess
Electron affinity determinations
EA (eV) | Method | Reference | Comment |
---|---|---|---|
1.45 ± 0.11 | IMRE | Dillow and Kebarle, 1989 | ΔGea(423 K) = -35.0±1.0 kcal/mol , assumed entropy = 3.5 eu; B |
1.50 ± 0.25 | ECD | Chen, Chen, et al., 1992 | B |
Ionization energy determinations
IE (eV) | Method | Reference | Comment |
---|---|---|---|
10.66 | PE | Furin, Zibarev, et al., 1989 | Vertical value; LL |

Ion clustering data

Data compiled as indicated in comments:
B - John E. Bartmess
M - Michael M. Meot-Ner (Mautner) and Sharon G. Lias
Clustering reactions
By formula: F- + C6F5NO2 = (F- • C6F5NO2)
Quantity | Value | Units | Method | Reference | Comment |
---|---|---|---|---|---|
ΔrH° | 172. ± 8.4 | kJ/mol | IMRE | Dillow and Kebarle, 1988 | gas phase; Anchored to C6F6..F- in Hiraoka, Mizuse, et al., 1987; B,M |
Quantity | Value | Units | Method | Reference | Comment |
ΔrS° | 82.0 | J/mol*K | N/A | Dillow and Kebarle, 1988 | gas phase; switching reaction,Thermochemical ladder(F-)C6F6, Entropy change calculated or estimated; Hiraoka, Mizuse, et al., 1987; M |
Quantity | Value | Units | Method | Reference | Comment |
ΔrG° | 137. ± 8.4 | kJ/mol | IMRE | Dillow and Kebarle, 1988 | gas phase; Anchored to C6F6..F- in Hiraoka, Mizuse, et al., 1987; B |
Free energy of reaction
ΔrG° (kJ/mol) | T (K) | Method | Reference | Comment |
---|---|---|---|---|
137. | 423. | PHPMS | Dillow and Kebarle, 1988 | gas phase; switching reaction,Thermochemical ladder(F-)C6F6, Entropy change calculated or estimated; Hiraoka, Mizuse, et al., 1987; M |

References

Paukov, 1971
Paukov, I.E.,
Specific heat from low temperatures, absolute entropy and enthalpy of pentafluoronitrobenzene,
Zhur. Fiz. Khim., 1971, 45, 1293-1294. [all data]
Aldrich Chemical Company Inc., 1990
Aldrich Chemical Company Inc.,
Catalog Handbook of Fine Chemicals, Aldrich Chemical Company, Inc., Milwaukee WI, 1990, 1. [all data]
Paukov, 1971, 2
Paukov, I.E.,
Specific heat from low temperatures, absolute entropy and enthalpy of pentafluoronitrobenzene,
Zh, Fiz. Khim., 1971, 45, 1293-4. [all data]
Domalski and Hearing, 1996
Domalski, Eugene S.; Hearing, Elizabeth D.,
Heat Capacities and Entropies of Organic Compounds in the Condensed Phase. Volume III,
J. Phys. Chem. Ref. Data, 1996, 25, 1, 1, https://doi.org/10.1063/1.555985
. [all data]
Dillow and Kebarle, 1988
Dillow, G.W.; Kebarle, P.,
Fluoride Affinities of Perfluorobenzenes C6F5X. Meisenheimer Complexes in the Gas Phase and Solution,
J. Am. Chem. Soc., 1988, 110, 15, 4877, https://doi.org/10.1021/ja00223a001
. [all data]
Hiraoka, Mizuse, et al., 1987
Hiraoka, K.; Mizuse, S.; Yamabe, S.,
A Determination of the Stability and Structure of F-(C6H6) and F-(C6F6) Clusters,
J. Chem. Phys., 1987, 86, 7, 4102, https://doi.org/10.1063/1.451920
. [all data]
Dillow and Kebarle, 1989
Dillow, G.W.; Kebarle, P.,
Substituent Effects on the Electron Affinities of Perfluorobenzenes C6F5X,
J. Am. Chem. Soc., 1989, 111, 15, 5592, https://doi.org/10.1021/ja00197a014
. [all data]
Chen, Chen, et al., 1992
Chen, E.C.M.; Chen, E.S.; Milligan, M.S.; Wentworth, W.E.; Wiley, J.R.,
Experimental Determination of the Electron Affinities of Nitrobenzene, Nitrotoluenes, Pentafluoronitrobenzene, and Isotopic Nitrobenzenes an,
J. Phys. Chem., 1992, 96, 5, 2385, https://doi.org/10.1021/j100184a069
. [all data]
Furin, Zibarev, et al., 1989
Furin, G.G.; Zibarev, A.V.; Sultanov, A.Sh.; Furlei, I.I.,
Order and structure of the outer valence Mo's of some derivatives of pentafluorobenzene,
Bull. Acad. Sci. USSR, Div. Chem. Sci., 1989, 4, 772. [all data]
(editor), 1967
(editor), Koptyug V.A.,
Atlas of Spectra of Aromatic and Heterocyclic Compounds, 1967, 1, 113. [all data]