Hydroquinone, tetrachloro-
- Formula: C6H2Cl4O2
- Molecular weight: 247.891
- IUPAC Standard InChIKey: STOSPPMGXZPHKP-UHFFFAOYSA-N
- CAS Registry Number: 87-87-6
- Chemical structure:
View 3d structure (requires JavaScript / HTML 5) - Other names: 1,4-Benzenediol, 2,3,5,6-tetrachloro-; Tetrachloro-p-benzohydroquinone; Tetrachloro-p-hydroquinone; Tetrachlorobenzoquinol; Tetrachlorohydroquinone; 2,3,5,6-Tetrachlorohydroquinone; 2,3,5,6-Tetrachloro-1,4-benzenediol; 2,3,5,6-Tetrachlorobenzene-1,4-diol; USAF DO-62; Dihydro-p-chloranil; Nordrosophilin A; NSC 100888; Perchlorohydroquinone; Tetrachloro-1,4-benzenediol

Condensed phase thermochemistry data

Data compiled by: Hussein Y. Afeefy, Joel F. Liebman, and Stephen E. Stein
Quantity | Value | Units | Method | Reference | Comment |
---|---|---|---|---|---|
ΔfH°solid | -463.2 | kJ/mol | Ccb | Sjostrom, 1936 | At 318 K |
Quantity | Value | Units | Method | Reference | Comment |
ΔcH°solid | -2287.8 ± 8.4 | kJ/mol | Ccb | Smith, Bjellerup, et al., 1953 | Reanalyzed by Cox and Pilcher, 1970, Original value = -2290. ± 8. kJ/mol |
ΔcH°solid | -2277. | kJ/mol | Ccb | Sjostrom, 1936 | At 318 K |
ΔcH°solid | -2355. | kJ/mol | Ccb | Swietoslawski and Starczedska, 1925 |

Phase change data

Data compiled as indicated in comments:
ALS - Hussein Y. Afeefy, Joel F. Liebman, and Stephen E. Stein
AC - William E. Acree, Jr., James S. Chickos
Quantity | Value | Units | Method | Reference | Comment |
---|---|---|---|---|---|
ΔsubH° | 88.70 | kJ/mol | V | Coolidge and Coolidge, 1927 | ALS |
Enthalpy of sublimation
ΔsubH (kJ/mol) | Temperature (K) | Method | Reference | Comment |
---|---|---|---|---|
89.0 | 313. | N/A | Stephenson and Malanowski, 1987 | Based on data from 298. to 359. K.; AC |
88.7 | 333. to 356. | QF | Coolidge and Coolidge, 1927 | See also Jones, 1960.; AC |

Gas phase ion energetics data

Data compiled by: Sharon G. Lias, Rhoda D. Levin, and Sherif A. Kafafi
Ionization energy determinations
IE (eV) | Method | Reference |
---|---|---|
8.30 ± 0.05 | PI | Potapov, Kardash, et al., 1972 |

References

Sjostrom, 1936
Sjostrom, Av.G.,
De klorsubstituerade kinonernas och hydrokinonernas termokemi,
Svensk. Kim. Tidr., 1936, 48, 121-124. [all data]
Smith, Bjellerup, et al., 1953
Smith, L.; Bjellerup, L.; Krook, S.; Westermark, H.,
Heats of combustion of organic chloro compounds determined by the "quartz wool" method,
Acta Chem. Scand., 1953, 7, 65. [all data]
Cox and Pilcher, 1970
Cox, J.D.; Pilcher, G.,
Thermochemistry of Organic and Organometallic Compounds, Academic Press, New York, 1970, 1-636. [all data]
Swietoslawski and Starczedska, 1925
Swietoslawski, W.; Starczedska, H.,
Correction des donnees thermochimiques de M.A. Valeur,
J. Chem. Phys., 1925, 22, 399-401. [all data]
Coolidge and Coolidge, 1927
Coolidge, A.S.; Coolidge, M.S.,
The sublimation pressures of substituted quinones and hydroquinones,
J. Am. Chem. Soc., 1927, 49, 100-104. [all data]
Stephenson and Malanowski, 1987
Stephenson, Richard M.; Malanowski, Stanislaw,
Handbook of the Thermodynamics of Organic Compounds, 1987, https://doi.org/10.1007/978-94-009-3173-2
. [all data]
Jones, 1960
Jones, A.H.,
Sublimation Pressure Data for Organic Compounds.,
J. Chem. Eng. Data, 1960, 5, 2, 196-200, https://doi.org/10.1021/je60006a019
. [all data]
Potapov, Kardash, et al., 1972
Potapov, V.K.; Kardash, I.E.; Sorokin, V.V.; Sokolov, S.A.; Evlasheva, T.I.,
Photoionization of heteroaromatic compounds,
Khim. Vys. Energ., 1972, 6, 392. [all data]
Pummerer and Seifert, 1952
Pummerer, R.; Seifert, H.,
Chem. Ber., 1952, 85, 535. [all data]