Phenol, 2,6-dichloro-
- Formula: C6H4Cl2O
- Molecular weight: 163.001
- IUPAC Standard InChIKey: HOLHYSJJBXSLMV-UHFFFAOYSA-N
- CAS Registry Number: 87-65-0
- Chemical structure:
View 3d structure (requires JavaScript / HTML 5) - Other names: 2,6-Dichlorophenol; 2,6-Dichlorfenol; Rcra waste number U082

Gas phase thermochemistry data

Data compiled by: Hussein Y. Afeefy, Joel F. Liebman, and Stephen E. Stein
Quantity | Value | Units | Method | Reference | Comment |
---|---|---|---|---|---|
ΔfH°gas | -146.3 ± 1.5 | kJ/mol | Ccr | Ribeiro Da Silva, Ferrao, et al., 1994 | HCl (1:600 H2O) |

Condensed phase thermochemistry data

Data compiled by: Hussein Y. Afeefy, Joel F. Liebman, and Stephen E. Stein
Quantity | Value | Units | Method | Reference | Comment |
---|---|---|---|---|---|
ΔfH°solid | -222.1 ± 1.1 | kJ/mol | Ccr | Ribeiro Da Silva, Ferrao, et al., 1994 | HCl (1:600 H2O) |
Quantity | Value | Units | Method | Reference | Comment |
ΔcH°solid | -2758.0 ± 0.7 | kJ/mol | Ccr | Ribeiro Da Silva, Ferrao, et al., 1994 | HCl (1:600 H2O) |

Phase change data

Data compiled as indicated in comments:
BS - Robert L. Brown and Stephen E. Stein
TRC - Thermodynamics Research Center, NIST Boulder Laboratories, Chris Muzny director
AC - William E. Acree, Jr., James S. Chickos
ALS - Hussein Y. Afeefy, Joel F. Liebman, and Stephen E. Stein
DH - Eugene S. Domalski and Elizabeth D. Hearing
Quantity | Value | Units | Method | Reference | Comment |
---|---|---|---|---|---|
Tboil | 492.2 | K | N/A | Aldrich Chemical Company Inc., 1990 | BS |
Quantity | Value | Units | Method | Reference | Comment |
Tfus | 340.0 | K | N/A | Poeti, Faneli, et al., 1982 | Uncertainty assigned by TRC = 0.2 K; TRC |
Quantity | Value | Units | Method | Reference | Comment |
ΔvapH° | 59.6 ± 0.3 | kJ/mol | GS | Verevkin, Emel'yanenko, et al., 2007 | Based on data from 341. to 371. K.; AC |
ΔvapH° | 58.5 ± 0.5 | kJ/mol | N/A | Mokbel, Pauchon, et al., 1995 | Based on data from 343. to 457. K. See also Verevkin, Emel'yanenko, et al., 2007.; AC |
Quantity | Value | Units | Method | Reference | Comment |
ΔsubH° | 79.3 ± 0.2 | kJ/mol | GS | Verevkin, Emel'yanenko, et al., 2007 | Based on data from 299. to 331. K.; AC |
ΔsubH° | 75.8 ± 1.0 | kJ/mol | C | Ribeiro Da Silva, Ferrao, et al., 1994 | HCl (1:600 H2O); ALS |
ΔsubH° | 75.8 ± 1.1 | kJ/mol | C | da Silva, 1994 | AC |
Reduced pressure boiling point
Tboil (K) | Pressure (bar) | Reference | Comment |
---|---|---|---|
355.7 | 0.005 | Weast and Grasselli, 1989 | BS |
Enthalpy of vaporization
ΔvapH (kJ/mol) | Temperature (K) | Method | Reference | Comment |
---|---|---|---|---|
55.4 | 356. | GS | Verevkin, Emel'yanenko, et al., 2007 | Based on data from 341. to 371. K.; AC |
51.6 | 400. | N/A | Mokbel, Pauchon, et al., 1995 | Based on data from 343. to 457. K. See also Verevkin, Emel'yanenko, et al., 2007.; AC |
57.9 | 348. | A | Stephenson and Malanowski, 1987 | Based on data from 333. to 493. K. See also Stull, 1947.; AC |
Antoine Equation Parameters
log10(P) = A − (B / (T + C))
P = vapor pressure (bar)
T = temperature (K)
View plot Requires a JavaScript / HTML 5 canvas capable browser.
Temperature (K) | A | B | C | Reference | Comment |
---|---|---|---|---|---|
332.7 to 493. | 5.32813 | 2431.802 | -36.391 | Stull, 1947 | Coefficents calculated by NIST from author's data. |
Enthalpy of fusion
ΔfusH (kJ/mol) | Temperature (K) | Reference | Comment |
---|---|---|---|
22.141 | 340.0 | Poeti, Fanelli, et al., 1982 | DH |
22.14 | 340. | Domalski and Hearing, 1996 | AC |
Entropy of fusion
ΔfusS (J/mol*K) | Temperature (K) | Reference | Comment |
---|---|---|---|
65.12 | 340.0 | Poeti, Fanelli, et al., 1982 | DH |

Gas phase ion energetics data

Data compiled by: Sharon G. Lias, Rhoda D. Levin, and Sherif A. Kafafi
Ionization energy determinations
IE (eV) | Method | Reference |
---|---|---|
8.65 ± 0.02 | PE | Maier and Turner, 1973 |

Kovats' RI, non-polar column, isothermal

View large format table.

Column type Active phase Temperature (C) I Reference Comment
CapillarySE-30160.1200.Evans and Haken, 1989Column length: 25. m; Column diameter: 0.32 mm
CapillarySE-30180.1194.Shakirov, Tsypysheva, et al., 1988Column length: 20. m; Column diameter: 0.2 mm
CapillarySE-30140.1189.Korhonen, 1984
CapillarySE-30160.1200.Korhonen, 1984
CapillarySE-30180.1214.Korhonen, 1984
PackedMethyl Silicone150.1203.Radecki, Grzybowski, et al., 1979

Kovats' RI, non-polar column, custom temperature program

View large format table.

Column type Active phase I Reference Comment
PackedSE-301206.Grzybowski, Lamparczyk, et al., 1980Chromosorb W HMDS (80-100 mesh); Column length: 2.9 m; Program: not specified

Kovats' RI, polar column, isothermal

View large format table.

Column type Active phase Temperature (C) I Reference Comment
CapillaryFFAP160.2097.Evans and Haken, 1989Column length: 25. m; Column diameter: 0.35 mm
CapillaryFFAP160.2097.Korhonen, 1984
CapillaryFFAP180.2081.Korhonen, 1984
CapillaryFFAP200.2083.Korhonen, 1984

Van Den Dool and Kratz RI, non-polar column, temperature ramp

View large format table.

Column type Active phase I Reference Comment
CapillaryDB-51205.Gocmen, Elston, et al., 200560. m/0.25 mm/0.25 μm, 7. K/min; Tstart: 40. C; Tend: 275. C
CapillaryDB-51213.Gocmen, Elston, et al., 200560. m/0.25 mm/0.25 μm, 7. K/min; Tstart: 40. C; Tend: 275. C
CapillarySE-301198.Korhonen, 198410. K/min; Tstart: 100. C
CapillarySE-301179.Korhonen, 19842. K/min; Tstart: 100. C
CapillarySE-301190.Korhonen, 19846. K/min; Tstart: 100. C

Van Den Dool and Kratz RI, non-polar column, custom temperature program

View large format table.

Column type Active phase I Reference Comment
CapillaryVF-5MS1223.2Tret'yakov, 200730. m/0.25 mm/0.25 μm, He; Program: Multi-step temperature program; T(initial)=60C; T(final)=270C
Capillary5 % Phenyl methyl siloxane1199.Yasuhara, Shiraishi, et al., 199725. m/0.31 mm/0.52 μm, He; Program: 50C(2min) => (20C/min) => 120C => (7C/min) => 310C(10min)

Van Den Dool and Kratz RI, polar column, temperature ramp

View large format table.

Column type Active phase I Reference Comment
CapillaryDB-Wax2119.Gocmen, Elston, et al., 200530. m/0.32 mm/0.5 μm, 7. K/min, 240. C @ 5. min; Tstart: 40. C
CapillaryDB-Wax2124.Gocmen, Elston, et al., 200530. m/0.32 mm/0.5 μm, 7. K/min, 240. C @ 5. min; Tstart: 40. C
CapillaryFFAP2061.Korhonen, 198410. K/min; Tstart: 100. C
CapillaryFFAP2038.Korhonen, 19846. K/min; Tstart: 100. C

Normal alkane RI, non-polar column, temperature ramp

View large format table.

Column type Active phase I Reference Comment
CapillaryOV-1011149.Messadi and Ali-Mokhnache, 19932. K/min; Column length: 25. m; Column diameter: 0.20 mm; Tstart: 80. C
CapillaryOV-1011151.Messadi and Ali-Mokhnache, 19932. K/min; Column length: 25. m; Column diameter: 0.20 mm; Tstart: 80. C
CapillaryOV-1011178.Messadi and Ali-Mokhnache, 19932. K/min; Column length: 25. m; Column diameter: 0.20 mm; Tstart: 80. C
CapillaryOV-1011179.Messadi and Ali-Mokhnache, 19932. K/min; Column length: 25. m; Column diameter: 0.20 mm; Tstart: 80. C
CapillaryUltra-11168.Okumura, 199125. m/0.32 mm/0.25 μm, He, 3. K/min; Tstart: 80. C; Tend: 260. C

Normal alkane RI, non-polar column, custom temperature program

View large format table.

Column type Active phase I Reference Comment
CapillaryMethyl Silicone1189.Yu and Zazhi, 2005Program: not specified
CapillaryPTE-51227.Nakano, Fujimori, et al., 199225. m/0.20 mm/0.33 μm; Program: 50 0C (2 min) 30 0C/min -> 200 0C 8 0C/min -> 280 0C (10 min)
CapillaryUltra-21228.Nakano, Fujimori, et al., 199225. m/0.20 mm/0.33 μm; Program: 50 0C (2 min) 30 0C/min -> 200 0C 8 0C/min -> 280 0C (10 min)
CapillarySE-301206.Peterson, 1992Program: not specified

Lee's RI, non-polar column, temperature ramp

View large format table.

Column type Active phase I Reference Comment
CapillaryDB-5MS204.68Chen, Keeran, et al., 200230. m/0.25 mm/0.5 μm, 40. C @ 1. min, 10. K/min; Tend: 310. C
CapillaryDB-5MS203.40Chen, Keeran, et al., 200230. m/0.25 mm/0.5 μm, 40. C @ 1. min, 4. K/min; Tend: 310. C

References

Ribeiro Da Silva, Ferrao, et al., 1994
Ribeiro Da Silva, M.A.V.; Ferrao, M.L.C.C.H.; Jiye, F.,
Standard enthalpies of combustion of the six dichlorophenols by rotating-bomb calorimetry,
J. Chem. Thermodyn., 1994, 26, 839-846. [all data]
Aldrich Chemical Company Inc., 1990
Aldrich Chemical Company Inc.,
Catalog Handbook of Fine Chemicals, Aldrich Chemical Company, Inc., Milwaukee WI, 1990, 1. [all data]
Poeti, Faneli, et al., 1982
Poeti, G.; Faneli, E.; Braghetti, M.J.,
A differential scanning calorimetric study of some phenol derivatives,
Therm. Anal., 1982, 24, 2, 273, https://doi.org/10.1007/BF01913681
. [all data]
Verevkin, Emel'yanenko, et al., 2007
Verevkin, Sergey P.; Emel'yanenko, Vladimir N.; Klamt, Andreas,
Thermochemistry of Chlorobenzenes and Chlorophenols: Ambient Temperature Vapor Pressures and Enthalpies of Phase Transitions,
J. Chem. Eng. Data, 2007, 52, 2, 499-510, https://doi.org/10.1021/je060429r
. [all data]
Mokbel, Pauchon, et al., 1995
Mokbel, I.; Pauchon, V.; Jose, J.,
Vapor pressures and sublimation pressures of 2,4-dichlorophenol, 2,6-dichlorophenol, and 2,4,6-trichlorophenol,
ELDATA: Int. Electron. J. Phys. Chem. Data, 1995, 1, 1, 53. [all data]
da Silva, 1994
da Silva, M.,
Standard enthalpies of combustion of the six dichlorophenols by rotating-bomb calorimetry,
The Journal of Chemical Thermodynamics, 1994, 26, 8, 839-846, https://doi.org/10.1006/jcht.1994.1100
. [all data]
Weast and Grasselli, 1989
CRC Handbook of Data on Organic Compounds, 2nd Editon, Weast,R.C and Grasselli, J.G., ed(s)., CRC Press, Inc., Boca Raton, FL, 1989, 1. [all data]
Stephenson and Malanowski, 1987
Stephenson, Richard M.; Malanowski, Stanislaw,
Handbook of the Thermodynamics of Organic Compounds, 1987, https://doi.org/10.1007/978-94-009-3173-2
. [all data]
Stull, 1947
Stull, Daniel R.,
Vapor Pressure of Pure Substances. Organic and Inorganic Compounds,
Ind. Eng. Chem., 1947, 39, 4, 517-540, https://doi.org/10.1021/ie50448a022
. [all data]
Poeti, Fanelli, et al., 1982
Poeti, G.; Fanelli, E.; Braghetti, M.,
A differential scanning calorimetric study of some phenol derivatives,
J. Therm. Anal., 1982, 24(2), 273-279. [all data]
Domalski and Hearing, 1996
Domalski, Eugene S.; Hearing, Elizabeth D.,
Heat Capacities and Entropies of Organic Compounds in the Condensed Phase. Volume III,
J. Phys. Chem. Ref. Data, 1996, 25, 1, 1, https://doi.org/10.1063/1.555985
. [all data]
Maier and Turner, 1973
Maier, J.P.; Turner, D.W.,
Steric inhibition of resonance studied by molecular photoelectron spectroscopy Part 3. Anilines, Phenols and Related Compounds,
J. Chem. Soc. Faraday Trans. 2, 1973, 69, 521. [all data]