Tricyclo[3.3.1.13,7]decane,2-methylene-
- Formula: C11H16
- Molecular weight: 148.2447
- IUPAC Standard InChIKey: JTCQPLINQYIRDZ-UHFFFAOYSA-N
- CAS Registry Number: 875-72-9
- Chemical structure:
View 3d structure (requires JavaScript / HTML 5) - Species with the same structure:

Gas phase ion energetics data

Data compiled by: Sharon G. Lias, Rhoda D. Levin, and Sherif A. Kafafi
Ionization energy determinations
IE (eV) | Method | Reference | Comment |
---|---|---|---|
8.86 ± 0.02 | PE | Worrell, Verhoeven, et al., 1974 | Vertical value |
Appearance energy determinations
Ion | AE (eV) | Other Products | Method | Reference | Comment |
---|---|---|---|---|---|
C11H16+ | 8.82 | ? | PE | Worley, Mateescu, et al., 1973 |

References

Worrell, Verhoeven, et al., 1974
Worrell, C.; Verhoeven, J.W.; Speckamp, W.N.,
Through-bond interaction in 1-aza-adamantane derivatives,
Tetrahedron, 1974, 30, 3525. [all data]
Worley, Mateescu, et al., 1973
Worley, S.D.; Mateescu, G.D.; McFarland, C.W.; Fort, R.C., Jr.; Sheley, C.F.,
Photoelectron spectra and MINDO-SCF-MO calculations for adamantane and some of its derivatives,
J. Am. Chem. Soc., 1973, 95, 7580. [all data]