Gramine
- Formula: C11H14N2
- Molecular weight: 174.2423
- IUPAC Standard InChIKey: OCDGBSUVYYVKQZ-UHFFFAOYSA-N
- CAS Registry Number: 87-52-5
- Chemical structure:
View 3d structure (requires JavaScript / HTML 5) - Other names: 1H-Indole-3-methanamine, N,N-dimethyl-; Indole, 3-[(dimethylamino)methyl]-; Donaxin; Donaxine; Gramin; 3-[(Dimethylamino)methyl]indole; β-Dimethylaminomethylindole; beta-(Dimethylaminomethyl)indole; 3-(N,N-Dimethylaminomethyl)indole; N,N-Dimethyl-1H-indole-3-methylamine; (1H-Indol-3-ylmethyl)-dimethyl-amine; NSC 16892; b-(Dimethylaminomethyl)indole; 3-Dimethylaminomethylindol (gramin); 1H-Indol-3-yl-N,N-dimethylmethanamine; indol-3-ylmethyldimethylamine

Gas phase ion energetics data

Data compiled by: Sharon G. Lias, Rhoda D. Levin, and Sherif A. Kafafi
Ionization energy determinations
IE (eV) | Method | Reference | Comment |
---|---|---|---|
7.69 ± 0.16 | PE | Domelsmith, Munchausen, et al., 1977 | Vertical value |

Normal alkane RI, non-polar column, temperature ramp

Column type | Active phase | I | Reference | Comment |
---|---|---|---|---|
Capillary | DB-5 | 1620. | Przybylak, Ciesiolka, et al., 2005 | He, 180. C @ 2. min, 5. K/min, 300. C @ 10. min; Column length: 30. m; Column diameter: 0.25 mm |

Normal alkane RI, non-polar column, custom temperature program

Column type | Active phase | I | Reference | Comment |
---|---|---|---|---|
Capillary | DB-1 | 1620. | El-Shazly, Ateya, et al., 2001 | Helium; Column length: 15. m; Column diameter: 0.317 mm; Program: 150 0C (2 min) 15 0C/min -> 250 0C 25 0C/min -> 300 0C (5 min) |
Capillary | DB-1 | 1622. | Wink, Meissner, et al., 1995 | Column length: 30. m; Column diameter: 0.3 mm; Program: not specified |

References

Domelsmith, Munchausen, et al., 1977
Domelsmith, L.N.; Munchausen, L.L.; Houk, K.N.,
Photoelectron spectra of psychotropic drugs. 1. Phenethylamines, tryptamines, and LSD,
J. Am. Chem. Soc., 1977, 99, 4311. [all data]
Przybylak, Ciesiolka, et al., 2005
Przybylak, J.K.; Ciesiolka, D.; Wysocka, W.; García-López, P.M.; Ruiz-López, M.A.; Wysocki, W.; Gulewicz, K.,
Alkaloid profiles of Mexican wild lupin and an effect of alkaloid preparation from Lupinus exaltatus seeds on growth and yield of paprika (Capsicum annuum L.),
Ind. Crops Prod., 2005, 21, 1, 1-7, https://doi.org/10.1016/j.indcrop.2003.12.001
. [all data]
El-Shazly, Ateya, et al., 2001
El-Shazly, A.; Ateya, A.-M.M.; Wink, M.,
Quinolizidine alkaloid profiles of lupunus varius orientalis. L. albus albus, L. hartwegii, and L. densiflorus,
Z. Naturforsch., 2001, 56c, 21-30. [all data]
Wink, Meissner, et al., 1995
Wink, M.; Meissner, C.; Witte, L.,
Patterns of quinolizidine alkaloids in 56 species of the genus Lupinus,
Phytochemistry, 1995, 38, 1, 139-153, https://doi.org/10.1016/0031-9422(95)91890-D
. [all data]