Benzonitrile, 4-methoxy-
- Formula: C8H7NO
- Molecular weight: 133.1473
- IUPAC Standard InChIKey: XDJAAZYHCCRJOK-UHFFFAOYSA-N
- CAS Registry Number: 874-90-8
- Chemical structure:
View 3d structure (requires JavaScript / HTML 5) - Other names: p-Anisonitrile; p-Anisylnitrile; p-Cyanoanisole; p-Methoxybenzonitrile; p-Methoxyphenyl cyanide; 4-Cyanoanisole; 4-Methoxybenzonitrile; Anisonitrile; 4-Methoxybenzonitril; NSC 3777; NSC 71539; 1-Cyano-4-methoxybenzene

Phase change data

Data compiled as indicated in comments:
BS - Robert L. Brown and Stephen E. Stein
TRC - Thermodynamics Research Center, NIST Boulder Laboratories, Chris Muzny director
Quantity | Value | Units | Method | Reference | Comment |
---|---|---|---|---|---|
Tboil | 529.7 | K | N/A | Weast and Grasselli, 1989 | BS |
Quantity | Value | Units | Method | Reference | Comment |
Tfus | 332.65 | K | N/A | Curran and Estok, 1950 | Uncertainty assigned by TRC = 0.6 K; TRC |
Reduced pressure boiling point
Tboil (K) | Pressure (bar) | Reference | Comment |
---|---|---|---|
529.7 | 1.02 | Aldrich Chemical Company Inc., 1990 | BS |

Gas phase ion energetics data

Data compiled as indicated in comments:
LLK - Sharon G. Lias, Rhoda D. Levin, and Sherif A. Kafafi
RDSH - Henry M. Rosenstock, Keith Draxl, Bruce W. Steiner, and John T. Herron
Ionization energy determinations
IE (eV) | Method | Reference | Comment |
---|---|---|---|
8.6 | PE | Modelli and Distefano, 1981 | LLK |
8.74 | EI | Cooks, Bertrand, et al., 1973 | LLK |
9.08 ± 0.05 | EI | Buchs, 1970 | RDSH |
9.0 ± 0.1 | EI | Brown, 1970 | RDSH |
8.92 | PE | Modelli and Distefano, 1981 | Vertical value; LLK |
Appearance energy determinations
Ion | AE (eV) | Other Products | Method | Reference | Comment |
---|---|---|---|---|---|
C7H4NO+ | 12.7 ± 0.1 | CH3 | EI | Brown, 1970 | RDSH |
C7H4NO+ | 12.7 ± 0.1 | CH3 | EI | Tait, Shannon, et al., 1962 | RDSH |
C7H5N+ | 12.39 | HCHO | EI | Cooks, Bertrand, et al., 1973 | LLK |
C7H5N+ | 12.3 ± 0.1 | CH2O | EI | Brown, 1970 | RDSH |

Van Den Dool and Kratz RI, non-polar column, temperature ramp

Column type | Active phase | I | Reference | Comment |
---|---|---|---|---|
Capillary | DB-1 | 1218.7 | Chang, Sheng, et al., 1989 | 2. K/min; Column length: 30. m; Column diameter: 0.25 mm; Tstart: 50. C; Tend: 300. C |
Capillary | DB-1 | 1221.9 | Chang, Sheng, et al., 1989 | 2. K/min; Column length: 30. m; Column diameter: 0.25 mm; Tstart: 50. C; Tend: 300. C |

Van Den Dool and Kratz RI, polar column, temperature ramp

Column type | Active phase | I | Reference | Comment |
---|---|---|---|---|
Capillary | DB-Wax | 2088.5 | Chang, Sheng, et al., 1989 | 2. K/min; Column length: 30. m; Column diameter: 0.25 mm; Tstart: 50. C; Tend: 240. C |
Capillary | DB-Wax | 2089.9 | Chang, Sheng, et al., 1989 | 2. K/min; Column length: 30. m; Column diameter: 0.25 mm; Tstart: 50. C; Tend: 240. C |

References

Weast and Grasselli, 1989
CRC Handbook of Data on Organic Compounds, 2nd Editon, Weast,R.C and Grasselli, J.G., ed(s)., CRC Press, Inc., Boca Raton, FL, 1989, 1. [all data]
Curran and Estok, 1950
Curran, B.C.; Estok, G.K.,
The Stabilization of Highly Polar Resonacne Structures by Hydrogen Bonding I. Electric Moments,
J. Am. Chem. Soc., 1950, 72, 4575. [all data]
Aldrich Chemical Company Inc., 1990
Aldrich Chemical Company Inc.,
Catalog Handbook of Fine Chemicals, Aldrich Chemical Company, Inc., Milwaukee WI, 1990, 1. [all data]
Modelli and Distefano, 1981
Modelli, A.; Distefano, G.,
L. C. B. O.: An easy method to predict valence ionization energies. Application to substituted benzenes,
Z. Naturforsch. A:, 1981, 36, 1344. [all data]
Cooks, Bertrand, et al., 1973
Cooks, R.G.; Bertrand, M.; Beynon, J.H.; Rennekamp, M.E.; Setser, D.W.,
Energy partitioning data as an ion structure probe. Substituted anisoles,
J. Am. Chem. Soc., 1973, 95, 1732. [all data]
Buchs, 1970
Buchs, A.,
Etude par spectrometrie de masse de l'ionisation de benzonitriles, de phenylacetonitriles et de N,N-dimethylanilines substitues,
Helv. Chim. Acta, 1970, 53, 2026. [all data]
Brown, 1970
Brown, P.,
Kinetic studies in mass spectrometry. VIII. Competing [M-CH3] and [M-CH2O] reactions in substituted anisoles. Approximate activation energies from ionization appearance potentials,
Org. Mass Spectrom., 1970, 4, 519. [all data]
Tait, Shannon, et al., 1962
Tait, J.M.S.; Shannon, T.W.; Harrison, A.G.,
The structure of substituted C7 ions from benzyl derivatives at the appearance potential threshold,
J. Am. Chem. Soc., 1962, 84, 4. [all data]
Poplavskii, et al., 1978
Poplavskii, V.S., et al.,
Zhur. Organ. Khim., 1978, 14, 121. [all data]
Chang, Sheng, et al., 1989
Chang, L.P.; Sheng, L.S.; Yang, M.Z.; An, D.K.,
Retention index of essential oil in temperature-programmed capillary column gas chromatography,
Acta Pharm. Sin., 1989, 24, 11, 847-852. [all data]