2,4(1H,3H)-Pyrimidinedione, 1,3-dimethyl-
- Formula: C6H8N2O2
- Molecular weight: 140.1399
- IUPAC Standard InChIKey: JSDBKAHWADVXFU-UHFFFAOYSA-N
- CAS Registry Number: 874-14-6
- Chemical structure:

Gas phase thermochemistry data

Data compiled by: Hussein Y. Afeefy, Joel F. Liebman, and Stephen E. Stein
Quantity | Value | Units | Method | Reference | Comment |
---|---|---|---|---|---|
ΔfH°gas | -74.95 ± 0.36 | kcal/mol | Ccr | Imamura, Takahashi, et al., 1989 |

Condensed phase thermochemistry data

Data compiled as indicated in comments:
ALS - Hussein Y. Afeefy, Joel F. Liebman, and Stephen E. Stein
DH - Eugene S. Domalski and Elizabeth D. Hearing
Quantity | Value | Units | Method | Reference | Comment |
---|---|---|---|---|---|
ΔfH°solid | -98.1 ± 0.2 | kcal/mol | Ccr | Imamura, Takahashi, et al., 1989 | ALS |
Quantity | Value | Units | Method | Reference | Comment |
ΔcH°solid | -739.453 ± 0.069 | kcal/mol | Ccr | Imamura, Takahashi, et al., 1989 | ALS |
Constant pressure heat capacity of solid
Cp,solid (cal/mol*K) | Temperature (K) | Reference | Comment |
---|---|---|---|
40.6 | 298.15 | Imamura, Takahashi, et al., 1989 | One temperature, estimated.; DH |

Gas phase ion energetics data

Data compiled as indicated in comments:
B - John E. Bartmess
LLK - Sharon G. Lias, Rhoda D. Levin, and Sherif A. Kafafi
Electron affinity determinations
EA (eV) | Reference | Comment |
---|---|---|
0.04 ± 0.10 | Desfrancois, Abdoul-Carime, et al., 1999 | B |
Ionization energy determinations
IE (eV) | Method | Reference | Comment |
---|---|---|---|
8.8 ± 0.1 | EI | Verkin, Sukodub, et al., 1976 | LLK |
9.00 | PE | Dougherty, Wittel, et al., 1976 | Vertical value; LLK |
De-protonation reactions
C6H7N2O2- + =
By formula: C6H7N2O2- + H+ = C6H8N2O2
Quantity | Value | Units | Method | Reference | Comment |
---|---|---|---|---|---|
ΔrH° | 369.0 ± 2.0 | kcal/mol | IMRB | Lee, 2005 | gas phase; B |
ΔrH° | 370.7 ± 3.2 | kcal/mol | G+TS | Gronert, Feng, et al., 2000 | gas phase; B |
Quantity | Value | Units | Method | Reference | Comment |
ΔrG° | 363.0 ± 3.1 | kcal/mol | IMRB | Gronert, Feng, et al., 2000 | gas phase; B |
C6H7N2O2- + =
By formula: C6H7N2O2- + H+ = C6H8N2O2
Quantity | Value | Units | Method | Reference | Comment |
---|---|---|---|---|---|
ΔrH° | 384.0 ± 3.0 | kcal/mol | IMRB | Lee, 2005 | gas phase; B |

Phase change data

Data compiled as indicated in comments:
TRC - Thermodynamics Research Center, NIST Boulder Laboratories, Chris Muzny director
ALS - Hussein Y. Afeefy, Joel F. Liebman, and Stephen E. Stein
AC - William E. Acree, Jr., James S. Chickos
DH - Eugene S. Domalski and Elizabeth D. Hearing

Quantity Value Units Method Reference Comment
Tfus392.5KN/AZielenkiewicz, Zielenkiewicz, et al., 1984Uncertainty assigned by TRC = 0.5 K; TRC
Quantity Value Units Method Reference Comment
Δvap71. ± 3.kJ/molVBeak and White, 1982ALS
Quantity Value Units Method Reference Comment
Δsub96.9 ± 1.2kJ/molCImamura, Takahashi, et al., 1989ALS
Δsub96.4 ± 1.4kJ/molCMurata, Sakiyama, et al., 1985AC
Δsub92.kJ/molVClark, Peschel, et al., 1965ALS

Enthalpy of sublimation

ΔsubH (kJ/mol) Temperature (K) Method Reference Comment
96.900298.15N/AImamura, Takahashi, et al., 1989DH
115.8 ± 3.0338.TEBrunetti, Piacente, et al., 2000Based on data from 311. - 367. K.; AC
101.7 ± 2.1338.QRTeplitsky, Yanson, et al., 1980Based on data from 313. - 363. K.; AC
46. ± 4.2426.HASNowak, Szczepaniak, et al., 1978Based on data from 400. - 454. K.; AC
92.344. - 370.HASClark, Peschel, et al., 1965, 2AC

Entropy of sublimation

ΔsubS (J/mol*K) Temperature (K) Reference Comment
325.0298.15Imamura, Takahashi, et al., 1989DH

Enthalpy of fusion

ΔfusH (kJ/mol) Temperature (K) Reference Comment
23.100392.5Zielenkiewicz, Zielenkiewicz, et al., 1984, 2DH
14.6398.Domalski and Hearing, 1996AC

Entropy of fusion

ΔfusS (J/mol*K) Temperature (K) Reference Comment
58.9392.5Zielenkiewicz, Zielenkiewicz, et al., 1984, 2DH

Enthalpy of phase transition

ΔHtrs (kJ/mol) Temperature (K) Initial Phase Final Phase Reference Comment
18.400394.crystaline, IIliquidSakiyama and Imamura, 1989Melting of the metastable phase.; DH
14.600398.crystaline, IliquidSakiyama and Imamura, 1989Melting of the stable phase.; DH

In addition to the Thermodynamics Research Center (TRC) data available from this site, much more physical and chemical property data is available from the following TRC products:

Reaction thermochemistry data

Data compiled as indicated in comments:
B - John E. Bartmess
ALS - Hussein Y. Afeefy, Joel F. Liebman, and Stephen E. Stein

Individual Reactions

C6H7N2O2- + Hydrogen cation = 2,4(1H,3H)-Pyrimidinedione, 1,3-dimethyl-

By formula: C6H7N2O2- + H+ = C6H8N2O2

Quantity Value Units Method Reference Comment
Δr1544. ± 8.4kJ/molIMRBLee, 2005gas phase; B
Δr1551. ± 13.kJ/molG+TSGronert, Feng, et al., 2000gas phase; B
Quantity Value Units Method Reference Comment
Δr1519. ± 13.kJ/molIMRBGronert, Feng, et al., 2000gas phase; B

2,4-Dimethoxypyrimidine = 2,4(1H,3H)-Pyrimidinedione, 1,3-dimethyl-

By formula: C6H8N2O2 = C6H8N2O2

Quantity Value Units Method Reference Comment
Δr-180. ± 13.kJ/molCisoBeak and White, 1982liquid phase; ALS
Δr-160. ± 20.kJ/molCisoBeak and White, 1982gas phase; ALS

4-Methoxy-1-methyl-2-pyrimidinone = 2,4(1H,3H)-Pyrimidinedione, 1,3-dimethyl-

By formula: C6H8N2O2 = C6H8N2O2

Quantity Value Units Method Reference Comment
Δr-104. ± 5.4kJ/molCisoBeak and White, 1982liquid phase; ALS
Δr-110. ± 17.kJ/molCisoBeak and White, 1982gas phase; ALS

C6H7N2O2- + Hydrogen cation = 2,4(1H,3H)-Pyrimidinedione, 1,3-dimethyl-

By formula: C6H7N2O2- + H+ = C6H8N2O2

Quantity Value Units Method Reference Comment
Δr1607. ± 13.kJ/molIMRBLee, 2005gas phase; B

References

Imamura, Takahashi, et al., 1989
Imamura, A.; Takahashi, K.; Murata, S.; Sakiyama, M.,
Standard enthalpies of formation of trimethyl cyanurate, malonamide, and 1,3-dimethyluracil,
J. Chem. Thermodyn., 1989, 21, 237-246. [all data]
Desfrancois, Abdoul-Carime, et al., 1999
Desfrancois, C.; Abdoul-Carime, H.; Carles, S.; Periquet, V.; Schermann, J.P.; Smith, D.M.A.; Adamowicz, L.,
Experimental and theoretical ab initio study of the influence of N-methylation on the dipole-bound electron affinities of thymine and uracil,
J. Chem. Phys., 1999, 110, 24, 11876-11883, https://doi.org/10.1063/1.479175
. [all data]
Verkin, Sukodub, et al., 1976
Verkin, B.I.; Sukodub, L.F.; Yanson, I.K.,
Ionization potentials of nitrogenous bases of of nucleic acids,
Dokl. Akad. Nauk SSSR, 1976, 228, 1452. [all data]
Dougherty, Wittel, et al., 1976
Dougherty, D.; Wittel, K.; Meeks, J.; McGlynn, S.P.,
Photoelectron spectroscopy of carbonyls. Ureas, uracils, and thymine,
J. Am. Chem. Soc., 1976, 98, 3815. [all data]
Lee, 2005
Lee, J.K.,
Insights into nucleic acid reactivity through gas-phase experimental and computational studies,
Int. J. Mass Spectrom., 2005, 240, 3, 261-272, https://doi.org/10.1016/j.ijms.2004.09.020
. [all data]
Gronert, Feng, et al., 2000
Gronert, S.; Feng, W.Y.; Chew, F.; Wu, W.M.,
The gas phase acid/base properties of 1,3,-dimethyluracil, 1-methyl-2-pyridone, and 1-methyl-4-pyridone: relevance to the mechanism of orotidine-5 '-monophosphate decarboxylase,
Int. J. Mass Spectrom., 2000, 196, 251-258, https://doi.org/10.1016/S1387-3806(99)00191-8
. [all data]