Benzonitrile, 4-amino-
- Formula: C7H6N2
- Molecular weight: 118.1359
- IUPAC Standard InChIKey: YBAZINRZQSAIAY-UHFFFAOYSA-N
- CAS Registry Number: 873-74-5
- Chemical structure:
View 3d structure (requires JavaScript / HTML 5) - Other names: Benzonitrile, p-amino-; p-Aminobenzonitrile; p-Cyanoaniline; 1-Amino-4-cyanobenzene; 4-Aminobenzonitrile; 4-Cyanoaniline; Aniline, p-cyano-

Phase change data

Data compiled by: Thermodynamics Research Center, NIST Boulder Laboratories, Chris Muzny director
Quantity | Value | Units | Method | Reference | Comment |
---|---|---|---|---|---|
Tfus | 359.4 | K | N/A | Curran and Estok, 1950 | Uncertainty assigned by TRC = 0.5 K |

Reaction thermochemistry data

Data compiled by: John E. Bartmess
Individual Reactions
C7H5N2- + =
By formula: C7H5N2- + H+ = C7H6N2
Quantity | Value | Units | Method | Reference | Comment |
---|---|---|---|---|---|
ΔrH° | 1459. ± 8.8 | kJ/mol | G+TS | Taft and Topsom, 1987 | gas phase; value altered from reference due to change in acidity scale |
Quantity | Value | Units | Method | Reference | Comment |
ΔrG° | 1429. ± 8.4 | kJ/mol | IMRE | Taft and Topsom, 1987 | gas phase; value altered from reference due to change in acidity scale |

Gas phase ion energetics data

Data compiled as indicated in comments:
B - John E. Bartmess
LLK - Sharon G. Lias, Rhoda D. Levin, and Sherif A. Kafafi
RDSH - Henry M. Rosenstock, Keith Draxl, Bruce W. Steiner, and John T. Herron
Ionization energy determinations
IE (eV) | Method | Reference | Comment |
---|---|---|---|
8.17 | PE | Modelli and Distefano, 1981 | LLK |
8.64 ± 0.04 | EI | Buchs, 1970 | RDSH |
8.51 | PE | Modelli and Distefano, 1981 | Vertical value; LLK |
De-protonation reactions
C7H5N2- + =
By formula: C7H5N2- + H+ = C7H6N2
Quantity | Value | Units | Method | Reference | Comment |
---|---|---|---|---|---|
ΔrH° | 1459. ± 8.8 | kJ/mol | G+TS | Taft and Topsom, 1987 | gas phase; value altered from reference due to change in acidity scale; B |
Quantity | Value | Units | Method | Reference | Comment |
ΔrG° | 1429. ± 8.4 | kJ/mol | IMRE | Taft and Topsom, 1987 | gas phase; value altered from reference due to change in acidity scale; B |

References

Curran and Estok, 1950
Curran, B.C.; Estok, G.K.,
The Stabilization of Highly Polar Resonacne Structures by Hydrogen Bonding I. Electric Moments,
J. Am. Chem. Soc., 1950, 72, 4575. [all data]
Taft and Topsom, 1987
Taft, R.W.; Topsom, R.D.,
The Nature and Analysis of Substituent Effects,
Prog. Phys. Org. Chem., 1987, 16, 1. [all data]
Modelli and Distefano, 1981
Modelli, A.; Distefano, G.,
L. C. B. O.: An easy method to predict valence ionization energies. Application to substituted benzenes,
Z. Naturforsch. A:, 1981, 36, 1344. [all data]
Buchs, 1970
Buchs, A.,
Etude par spectrometrie de masse de l'ionisation de benzonitriles, de phenylacetonitriles et de N,N-dimethylanilines substitues,
Helv. Chim. Acta, 1970, 53, 2026. [all data]
Abrams and Kallen, 1976
Abrams, W.R.; Kallen, R.J.,
J. Am. Chem. Soc., 1976, 98, 7777. [all data]