Benzene, 1-chloro-4-ethynyl-
- Formula: C8H5Cl
- Molecular weight: 136.578
- IUPAC Standard InChIKey: LFZJRTMTKGYJRS-UHFFFAOYSA-N
- CAS Registry Number: 873-73-4
- Chemical structure:
View 3d structure (requires JavaScript / HTML 5) - Other names: (p-Chlorophenyl)acetylene; (4-Chlorophenyl)acetylene; p-Ethynylchlorobenzene; 1-Chloro-4-ethynylbenzene

Gas phase ion energetics data

Data evaluated as indicated in comments:
HL - Edward P. Hunter and Sharon G. Lias
Data compiled as indicated in comments:
LLK - Sharon G. Lias, Rhoda D. Levin, and Sherif A. Kafafi
Quantity | Value | Units | Method | Reference | Comment |
---|---|---|---|---|---|
Proton affinity (review) | 832.4 | kJ/mol | N/A | Hunter and Lias, 1998 | HL |
Quantity | Value | Units | Method | Reference | Comment |
Gas basicity | 801.7 | kJ/mol | N/A | Hunter and Lias, 1998 | HL |
Ionization energy determinations
IE (eV) | Method | Reference | Comment |
---|---|---|---|
8.6 | PE | Griebel, Hohlneicher, et al., 1974 | LLK |
8.75 | PE | Griebel, Hohlneicher, et al., 1974 | Vertical value; LLK |

References

Hunter and Lias, 1998
Hunter, E.P.; Lias, S.G.,
Evaluated Gas Phase Basicities and Proton Affinities of Molecules: An Update,
J. Phys. Chem. Ref. Data, 1998, 27, 3, 413-656, https://doi.org/10.1063/1.556018
. [all data]
Griebel, Hohlneicher, et al., 1974
Griebel, R.; Hohlneicher, G.; Dorr, F.,
A photoelectron spectroscopic study of benzonitrile, ethynylbenzene and some of its substituted derivatives,
J. Electron Spectrosc. Relat. Phenom., 1974, 4, 185. [all data]