trans-β-Methylstyrene
- Formula: C9H10
- Molecular weight: 118.1757
- IUPAC Standard InChIKey: QROGIFZRVHSFLM-QHHAFSJGSA-N
- CAS Registry Number: 873-66-5
- Chemical structure:
View 3d structure (requires JavaScript / HTML 5) - Stereoisomers:
- Other names: (E)- β-Methylstyrene; trans-Propenylbenzene; Benzene, 1-propenyl-, (E)-; (E)-1-Propenyl benzene

Gas phase thermochemistry data

Data compiled by: Hussein Y. Afeefy, Joel F. Liebman, and Stephen E. Stein
Quantity | Value | Units | Method | Reference | Comment |
---|---|---|---|---|---|
ΔcH°gas | -5087.95 | kJ/mol | Ccb | Krall and Roberts, 1958 | Corresponding ΔfHºgas = 117.2 kJ/mol (simple calculation by NIST; no Washburn corrections) |

Condensed phase thermochemistry data

Data compiled by: Hussein Y. Afeefy, Joel F. Liebman, and Stephen E. Stein
Quantity | Value | Units | Method | Reference | Comment |
---|---|---|---|---|---|
ΔcH°liquid | -4985.2 | kJ/mol | Ccb | Auwsers, Roth, et al., 1910 | Corresponding ΔfHºliquid = 15. kJ/mol (simple calculation by NIST; no Washburn corrections) |

Phase change data

Data compiled as indicated in comments:
BS - Robert L. Brown and Stephen E. Stein
TRC - Thermodynamics Research Center, NIST Boulder Laboratories, Chris Muzny director
AC - William E. Acree, Jr., James S. Chickos
Quantity | Value | Units | Method | Reference | Comment |
---|---|---|---|---|---|
Tboil | 450. ± 3. | K | AVG | N/A | Average of 7 values; Individual data points |
Quantity | Value | Units | Method | Reference | Comment |
Tfus | 246.65 | K | N/A | Park and Wright, 1954 | Uncertainty assigned by TRC = 1. K; TRC |
Tfus | 243.23 | K | N/A | Anonymous, 1953 | Uncertainty assigned by TRC = 0.2 K; TRC |
Tfus | 243.82 | K | N/A | Anonymous, 1953 | Uncertainty assigned by TRC = 0.15 K; TRC |
Tfus | 243.08 | K | N/A | Anonymous, 1952 | Uncertainty assigned by TRC = 0.5 K; TRC |
Tfus | 242.15 | K | N/A | Lespieau, 1930 | Uncertainty assigned by TRC = 4. K; cis-trans isomer not identified, but m.p. corr. approx. to cis-; TRC |
Enthalpy of vaporization
ΔvapH (kJ/mol) | Temperature (K) | Method | Reference | Comment |
---|---|---|---|---|
46.4 | 306. | A | Stephenson and Malanowski, 1987 | Based on data from 291. to 452. K. See also Stull, 1947.; AC |

Reaction thermochemistry data

Data compiled by: Hussein Y. Afeefy, Joel F. Liebman, and Stephen E. Stein
Individual Reactions
By formula: H2 + C9H10 = C9H12
Quantity | Value | Units | Method | Reference | Comment |
---|---|---|---|---|---|
ΔrH° | -105.9 ± 1.3 | kJ/mol | Chyd | Abboud, Jimenez, et al., 1995 | liquid phase; solvent: Hyrocarbon; Like gas phase |
By formula: C9H10 = C9H10
Quantity | Value | Units | Method | Reference | Comment |
---|---|---|---|---|---|
ΔrH° | -11.0 ± 0.3 | kJ/mol | Eqk | Taskinen and Lindholm, 1994 | liquid phase; solvent: DMSO; Heat of isomerization |
By formula: C9H10 = C9H10
Quantity | Value | Units | Method | Reference | Comment |
---|---|---|---|---|---|
ΔrH° | -23.3 ± 0.5 | kJ/mol | Eqk | Taskinen and Lindholm, 1994 | liquid phase; solvent: DMSO |
By formula: C9H10 = C9H10
Quantity | Value | Units | Method | Reference | Comment |
---|---|---|---|---|---|
ΔrH° | -20.1 | kJ/mol | Eqk | Taskinen and Lindholm, 1994 | gas phase; Heat of isomerization |

Gas phase ion energetics data

Data evaluated as indicated in comments:
HL - Edward P. Hunter and Sharon G. Lias
Data compiled as indicated in comments:
LLK - Sharon G. Lias, Rhoda D. Levin, and Sherif A. Kafafi
Quantity | Value | Units | Method | Reference | Comment |
---|---|---|---|---|---|
Proton affinity (review) | 834.2 | kJ/mol | N/A | Hunter and Lias, 1998 | HL |
Quantity | Value | Units | Method | Reference | Comment |
Gas basicity | 805.3 | kJ/mol | N/A | Hunter and Lias, 1998 | HL |
Ionization energy determinations
IE (eV) | Method | Reference | Comment |
---|---|---|---|
8.1 | PE | Kobayashi, Arai, et al., 1981 | LLK |
8.20 ± 0.02 | PE | Maier and Turner, 1973 | LLK |
7.84 ± 0.04 | EI | Benito, Seidl, et al., 1973 | LLK |
8.34 | PE | Kobayashi, Arai, et al., 1981 | Vertical value; LLK |
8.32 | PE | Salisbury, 1974 | Vertical value; LLK |

Kovats' RI, non-polar column, isothermal

Column type | Active phase | Temperature (C) | I | Reference | Comment |
---|---|---|---|---|---|
Capillary | OV-101 | 100. | 1019. | Engewald, Topalova, et al., 1987 | Column length: 50. m; Column diameter: 0.30 mm |
Capillary | SE-30 | 70. | 1009.9 | Tóth, 1983 | N2; Column length: 15. m; Column diameter: 0.25 mm |

Kovats' RI, polar column, isothermal

Column type | Active phase | Temperature (C) | I | Reference | Comment |
---|---|---|---|---|---|
Capillary | PEG-20M | 70. | 1390.3 | Tóth, 1983 | N2; Column length: 30. m; Column diameter: 0.3 mm |
Packed | Carbowax 20M | 150. | 1430.1 | Ellis and Still, 1979 | Chromosorb W, AW-DMCS |
Packed | Carbowax 20M | 115. | 1423.6 | Ellis and Still, 1979 | Chromosorb G |
Packed | Carbowax 20M | 115. | 1423.6 | Ellis and Still, 1979 | Chromosorb G |
Capillary | Carbowax 20M | 90. | 1364.0 | Döring, Estel, et al., 1974 | Column length: 100. m; Column diameter: 0.2 mm |

Normal alkane RI, non-polar column, temperature ramp

Column type | Active phase | I | Reference | Comment |
---|---|---|---|---|
Capillary | HP-1 | 1008. | Fernandez, Lizzani-Cuvelier, et al., 2005 | 50. m/0.2 mm/0.25 μm, 60. C @ 60. min, 2. K/min; Tend: 250. C |

Normal alkane RI, polar column, isothermal

Column type | Active phase | Temperature (C) | I | Reference | Comment |
---|---|---|---|---|---|
Capillary | Carbowax 20M | 90. | 1364. | Sutter, Peterson, et al., 1997 |

Normal alkane RI, polar column, temperature ramp

Column type | Active phase | I | Reference | Comment |
---|---|---|---|---|
Capillary | Carbowax 20M | 1360. | Fernandez, Lizzani-Cuvelier, et al., 2005 | 50. m/0.2 mm/0.25 μm, 60. C @ 60. min, 2. K/min; Tend: 250. C |

References

Krall and Roberts, 1958
Krall, R.E.; Roberts, J.D.,
Strain variation in the unsaturated cyclobutane ring,
Am. Chem. Soc. Div. Pet. Chem., 1958, 3, 63-68. [all data]
Auwsers, Roth, et al., 1910
Auwsers, K.; Roth, W.A.; Eisenlohr, F.,
III. Verbrennungswarmen von Terpenen und Styrolen,
Justus Liebigs Ann. Chem., 1910, 267-290. [all data]
Park and Wright, 1954
Park, W.R.R.; Wright, G.F.,
J. Org. Chem., 1954, 19, 1435. [all data]
Anonymous, 1953
Anonymous, R.,
, Physical Properties of Chemical Substances, Dow Chemical Company, 1953. [all data]
Anonymous, 1952
Anonymous, R.,
, Physical Properties of Chemical Substances, Dow Chemical Co., 1952. [all data]
Lespieau, 1930
Lespieau, R.,
Preparation of the β Dibromides of Trimethylenic Hydrocarbons,
Bull. Soc. Chim. Fr., 1930, 47, 847. [all data]
Stephenson and Malanowski, 1987
Stephenson, Richard M.; Malanowski, Stanislaw,
Handbook of the Thermodynamics of Organic Compounds, 1987, https://doi.org/10.1007/978-94-009-3173-2
. [all data]
Stull, 1947
Stull, Daniel R.,
Vapor Pressure of Pure Substances. Organic and Inorganic Compounds,
Ind. Eng. Chem., 1947, 39, 4, 517-540, https://doi.org/10.1021/ie50448a022
. [all data]
Abboud, Jimenez, et al., 1995
Abboud, J.-L.M.; Jimenez, P.; Roux, M.V.; Turrion, C.; Lopez-Mardomingo, C.; Podosenin, A.; Rogers, D.W.; Liebman, J.F.,
Interrelations of the energetics of amides and alkenes: enthalpies of formation of N,N-dimethyl dertivatives of pivalamide, 1-adamantylcarboxamide and benzamide, and of styrene and its a-, trans-β- and β,β-methylated derivates,
J. Phys. Org. Chem., 1995, 8, 15-25. [all data]
Taskinen and Lindholm, 1994
Taskinen, E.; Lindholm, N.,
Relative thermodynamic stabilities of the isomeric propenylbenzenes,
J. Phys. Org. Chem., 1994, 7, 256-258. [all data]
Hunter and Lias, 1998
Hunter, E.P.; Lias, S.G.,
Evaluated Gas Phase Basicities and Proton Affinities of Molecules: An Update,
J. Phys. Chem. Ref. Data, 1998, 27, 3, 413-656, https://doi.org/10.1063/1.556018
. [all data]
Kobayashi, Arai, et al., 1981
Kobayashi, T.; Arai, T.; Sakuragi, H.; Tokumaru, K.; Utsunomiya, C.,
A new nethod for conformational analysis by photoelectron spectroscopy with application to alkyl-substituted styrenes,
Bull. Chem. Soc. Jpn., 1981, 54, 1658. [all data]
Maier and Turner, 1973
Maier, J.P.; Turner, D.W.,
Steric inhibition of resonance studied by molecular photoelectron spectroscopy. Part 2. Phenylethylenes,
J. Chem. Soc. Faraday Trans. 2, 1973, 69, 196. [all data]
Benito, Seidl, et al., 1973
Benito, I.; Seidl, H.; Bock, H.,
Efectos electronicos y estericos de sustituyentes alquilicos y silicicos sobre el sistema electronico π del estireno,
Rev. Fac. Cienc. Univ. Oviedo, 1973, 14, 95. [all data]
Salisbury, 1974
Salisbury, K.,
Quenching of the fluorescence of styrenes by ground state oxygen,
J. Photochem., 1974, 2, 401. [all data]