3-Chlorobenzyl alcohol
- Formula: C7H7ClO
- Molecular weight: 142.583
- IUPAC Standard InChIKey: ZSRDNPVYGSFUMD-UHFFFAOYSA-N
- CAS Registry Number: 873-63-2
- Chemical structure:
View 3d structure (requires JavaScript / HTML 5) - Other names: m-Chlorobenzyl alcohol; Benzenemethanol, 3-chloro-

Phase change data

Data compiled by: Robert L. Brown and Stephen E. Stein
Quantity | Value | Units | Method | Reference | Comment |
---|---|---|---|---|---|
Tboil | 510.2 | K | N/A | Aldrich Chemical Company Inc., 1990 |

Reaction thermochemistry data

Data compiled by: John E. Bartmess
Individual Reactions
C7H6ClO- + =
By formula: C7H6ClO- + H+ = C7H7ClO
Quantity | Value | Units | Method | Reference | Comment |
---|---|---|---|---|---|
ΔrH° | 1523. ± 8.8 | kJ/mol | G+TS | Mustanir, Than, et al., 2005 | gas phase |
Quantity | Value | Units | Method | Reference | Comment |
ΔrG° | 1495. ± 8.4 | kJ/mol | IMRE | Mustanir, Than, et al., 2005 | gas phase |

Gas phase ion energetics data

Data compiled as indicated in comments:
B - John E. Bartmess
LBLHLM - Sharon G. Lias, John E. Bartmess, Joel F. Liebman, John L. Holmes, Rhoda D. Levin, and W. Gary Mallard
Ionization energy determinations
IE (eV) | Method | Reference | Comment |
---|---|---|---|
8.51 | EI | Russell, Freiser, et al., 1983 | LBLHLM |
Appearance energy determinations
Ion | AE (eV) | Other Products | Method | Reference | Comment |
---|---|---|---|---|---|
C6H7+ | 10.00 | ? | EI | Russell, Freiser, et al., 1983 | LBLHLM |
C7H7O+ | 9.33 | Cl | EI | Russell, Freiser, et al., 1983 | LBLHLM |
De-protonation reactions
C7H6ClO- + =
By formula: C7H6ClO- + H+ = C7H7ClO
Quantity | Value | Units | Method | Reference | Comment |
---|---|---|---|---|---|
ΔrH° | 1523. ± 8.8 | kJ/mol | G+TS | Mustanir, Than, et al., 2005 | gas phase; B |
Quantity | Value | Units | Method | Reference | Comment |
ΔrG° | 1495. ± 8.4 | kJ/mol | IMRE | Mustanir, Than, et al., 2005 | gas phase; B |

References

Aldrich Chemical Company Inc., 1990
Aldrich Chemical Company Inc.,
Catalog Handbook of Fine Chemicals, Aldrich Chemical Company, Inc., Milwaukee WI, 1990, 1. [all data]
Mustanir, Than, et al., 2005
Mustanir; Than, S.; Mishima, M.,
Substituent effects on the gas phase acidity of phenylacetylenes and benzyl alcohols,
Bull. Chem. Soc. Japan, 2005, 78, 1, 147-153, https://doi.org/10.1246/bcsj.78.147
. [all data]
Russell, Freiser, et al., 1983
Russell, D.H.; Freiser, B.S.; McBay, E.H.; Canada, D.C.,
The structure of decomposing [C7H7O]+ ions: Benzyl versus tropylium ion structures,
Org. Mass Spectrom., 1983, 18, 474. [all data]