Benzonitrile, 2-chloro-
- Formula: C7H4ClN
- Molecular weight: 137.566
- IUPAC Standard InChIKey: NHWQMJMIYICNBP-UHFFFAOYSA-N
- CAS Registry Number: 873-32-5
- Chemical structure:
View 3d structure (requires JavaScript / HTML 5) - Other names: Benzonitrile, o-chloro-; o-Chlorobenzonitrile; o-Chlorocyanobenzene; o-Cyanochlorobenzene; 2-Chlorobenzonitrile; o-Chlorbenzonitril; Nitril kyseliny o-chlorbenzoove; 2-Chlorobenzoic acid nitrile

Phase change data

Data compiled as indicated in comments:
BS - Robert L. Brown and Stephen E. Stein
AC - William E. Acree, Jr., James S. Chickos
Quantity | Value | Units | Method | Reference | Comment |
---|---|---|---|---|---|
Tboil | 505.2 | K | N/A | Weast and Grasselli, 1989 | BS |
Enthalpy of vaporization
ΔvapH (kJ/mol) | Temperature (K) | Method | Reference | Comment |
---|---|---|---|---|
53.5 | 393. | EB | Aim, 1994 | Based on data from 378. to 486. K.; AC |

Gas phase ion energetics data

Data compiled by: Henry M. Rosenstock, Keith Draxl, Bruce W. Steiner, and John T. Herron
Ionization energy determinations
IE (eV) | Method | Reference |
---|---|---|
10.26 ± 0.06 | EI | Buchs, 1970 |

Normal alkane RI, non-polar column, temperature ramp

Column type | Active phase | I | Reference | Comment |
---|---|---|---|---|
Capillary | ZB-5 | 1117. | Kluchinsky, Sheely, et al., 2002 | 30. m/0.25 mm/0.25 μm, He, 10. K/min, 200. C @ 2. min; Tstart: 40. C |

References

Weast and Grasselli, 1989
CRC Handbook of Data on Organic Compounds, 2nd Editon, Weast,R.C and Grasselli, J.G., ed(s)., CRC Press, Inc., Boca Raton, FL, 1989, 1. [all data]
Aim, 1994
Aim, Karel,
A modified ebulliometric method for high-boiling substances: vapour pressures of 2-chlorobenzonitrile and 4-chlorobenzonitrile at temperatures from 380 K to 490 K,
The Journal of Chemical Thermodynamics, 1994, 26, 9, 977-986, https://doi.org/10.1006/jcht.1994.1115
. [all data]
Buchs, 1970
Buchs, A.,
Etude par spectrometrie de masse de l'ionisation de benzonitriles, de phenylacetonitriles et de N,N-dimethylanilines substitues,
Helv. Chim. Acta, 1970, 53, 2026. [all data]
Kluchinsky, Sheely, et al., 2002
Kluchinsky, T.A., Jr.; Sheely, M.V.; Savage, P.B.; Smith, P.A.,
Formation of 2-chlorobenzylidenemalononitrile (CS riot control agent) thermal degradation products at elevated temperatures,
J. Chromatogr. A, 2002, 952, 1-2, 205-213, https://doi.org/10.1016/S0021-9673(02)00096-1
. [all data]