Isopropylcyclobutane
- Formula: C7H14
- Molecular weight: 98.1861
- IUPAC Standard InChIKey: RFHQRRJFJJCQDJ-UHFFFAOYSA-N
- CAS Registry Number: 872-56-0
- Chemical structure:
View 3d structure (requires JavaScript / HTML 5) - Other names: Cyclobutane, isopropyl-

Phase change data

Data compiled by: Thermodynamics Research Center, NIST Boulder Laboratories, Chris Muzny director
Quantity | Value | Units | Method | Reference | Comment |
---|---|---|---|---|---|
Tboil | 365.7 | K | N/A | Kazanskii, Lukina, et al., 1955 | Uncertainty assigned by TRC = 1. K |
Tboil | 365.85 | K | N/A | Derfer, Greenlee, et al., 1949 | Uncertainty assigned by TRC = 0.2 K |
Quantity | Value | Units | Method | Reference | Comment |
Tfus | 166.72 | K | N/A | Derfer, Greenlee, et al., 1949 | Uncertainty assigned by TRC = 0.2 K |
Tfus | 166.8 | K | N/A | Anonymous, 1946 | Uncertainty assigned by TRC = 0.4 K |

Gas phase ion energetics data

Data compiled by: Sharon G. Lias and Joel F. Liebman
Ionization energy determinations
IE (eV) | Method | Reference |
---|---|---|
9.28 ± 0.05 | EI | Holmes and Lossing, 1991 |

Van Den Dool and Kratz RI, non-polar column, temperature ramp

Column type | Active phase | I | Reference | Comment |
---|---|---|---|---|
Capillary | DB-5 | 690.9 | Xu, van Stee, et al., 2003 | 30. m/0.25 mm/1. μm, He, 2.5 K/min; Tstart: 50. C; Tend: 200. C |

References

Kazanskii, Lukina, et al., 1955
Kazanskii, B.A.; Lukina, M.Y.; Nakhapetyan, L.A.,
Dehydration of dimethylcyclobutylcarbinol,
Dokl. Akad. Nauk SSSR, 1955, 101, 683-6. [all data]
Derfer, Greenlee, et al., 1949
Derfer, J.M.; Greenlee, K.W.; Boord, C.E.,
A New Synthesis of Monoalkylcyclobutanes: Reduction of Neopentyl Type Tribromides,
J. Am. Chem. Soc., 1949, 71, 175. [all data]
Anonymous, 1946
Anonymous, R.,
, Am. Pet. Inst. Res. Proj. 45, Ohio State Univ., 1946. [all data]
Holmes and Lossing, 1991
Holmes, J.L.; Lossing, F.P.,
Ionization energies of homologous organic compounds and correlation with molecular size,
Org. Mass Spectrom., 1991, 26, 537. [all data]
Xu, van Stee, et al., 2003
Xu, X.; van Stee, L.L.P.; Williams, J.; Beens, J.; Adahchour, M.; Vreuls, R.J.J.; Brinkman, U.A.Th.; Lelieveld, J.,
Comprehensive two-dimensional gas chromatography (GC×GC) measurements of volatile organic compounds in the atmosphere,
Atmos. Chem. Phys., 2003, 3, 3, 665-682, https://doi.org/10.5194/acp-3-665-2003
. [all data]