Thiophene, 2-ethyl-
- Formula: C6H8S
- Molecular weight: 112.193
- IUPAC Standard InChIKey: JCCCMAAJYSNBPR-UHFFFAOYSA-N
- CAS Registry Number: 872-55-9
- Chemical structure:
View 3d structure (requires JavaScript / HTML 5) - Other names: 2-Ethylthiophene; 2-Ethylthiophenol

Phase change data

Data compiled as indicated in comments:
BS - Robert L. Brown and Stephen E. Stein
TRC - Thermodynamics Research Center, NIST Boulder Laboratories, Chris Muzny director
AC - William E. Acree, Jr., James S. Chickos
Quantity | Value | Units | Method | Reference | Comment |
---|---|---|---|---|---|
Tboil | 407.2 | K | N/A | Weast and Grasselli, 1989 | BS |
Tboil | 406.15 | K | N/A | Levi and Nicholls, 1958 | Uncertainty assigned by TRC = 2. K; TRC |
Tboil | 407. | K | N/A | Wender, Greenfield, et al., 1951 | Uncertainty assigned by TRC = 4. K; TRC |
Quantity | Value | Units | Method | Reference | Comment |
ΔvapH° | 9.5 ± 0.2 | kcal/mol | C | Ribeiro da Silva and Santos, 2007 | AC |
Enthalpy of vaporization
ΔvapH (kcal/mol) | Temperature (K) | Method | Reference | Comment |
---|---|---|---|---|
9.49 | 348. | IA | Stephenson and Malanowski, 1987 | Based on data from 333. to 374. K. See also Eon, Pommier, et al., 1971 and Dykyj, Svoboda, et al., 1999.; AC |
Antoine Equation Parameters
log10(P) = A − (B / (T + C))
P = vapor pressure (atm)
T = temperature (K)
View plot Requires a JavaScript / HTML 5 canvas capable browser.
Temperature (K) | A | B | C | Reference | Comment |
---|---|---|---|---|---|
333.4 to 373.5 | 5.34485 | 2248.151 | 15.596 | Eon, Pommier, et al., 1971 | Coefficents calculated by NIST from author's data. |

Gas phase ion energetics data

Data compiled as indicated in comments:
LLK - Sharon G. Lias, Rhoda D. Levin, and Sherif A. Kafafi
RDSH - Henry M. Rosenstock, Keith Draxl, Bruce W. Steiner, and John T. Herron
Ionization energy determinations
IE (eV) | Method | Reference | Comment |
---|---|---|---|
8.57 | CTS | Aloisi and Pignataro, 1973 | LLK |
8.67 ± 0.05 | EI | Linda, Marino, et al., 1971 | LLK |
8.8 ± 0.2 | EI | Khvostenko, 1962 | RDSH |
Appearance energy determinations
Ion | AE (eV) | Other Products | Method | Reference | Comment |
---|---|---|---|---|---|
C4H4S+ | 11.5 ± 0.2 | ? | EI | Khvostenko, 1962 | RDSH |
C5H5S+ | 11.4 ± 0.2 | CH3 | EI | Khvostenko, 1962 | RDSH |

Van Den Dool and Kratz RI, polar column, custom temperature program

Data compiled by: NIST Mass Spectrometry Data Center, William E. Wallace, director

Column type CapillaryCapillaryCapillary
Active phase CP-Wax 52CBCP-Wax 52CBCP-Wax 52CB
Column length (m) 60.60.50.
Carrier gas HeHe
Substrate
Column diameter (mm) 0.250.250.32
Phase thickness (μm) 0.250.250.21
Program 45C(5min) => 10C/min => 80C => 2C/min => 240C45C(5min) => 10C/min => 80C => 2C/min => 240C0C(5min) => fast => 60C(5min) => 4C/min => 220C(20min)
I 1179.1170.1170.
ReferenceRomeo, Ziino, et al., 2007Condurso, Verzera, et al., 2006Madruga and Mottram, 1998
Comment MSDC-RI MSDC-RI MSDC-RI

References

Weast and Grasselli, 1989
CRC Handbook of Data on Organic Compounds, 2nd Editon, Weast,R.C and Grasselli, J.G., ed(s)., CRC Press, Inc., Boca Raton, FL, 1989, 1. [all data]
Levi and Nicholls, 1958
Levi, L.; Nicholls, R.V.V.,
Formation of Styrene by Pyrolysis of Aromatic Heterocyclic Aldehyde- Aliphatic Acid Anhydride Mixtures on Morden Bentonite,
Ind. Eng. Chem., 1958, 50, 1005. [all data]
Wender, Greenfield, et al., 1951
Wender, I.; Greenfield, H.; Orchin, M.,
Chemistry of Oxo and Related Reactions IV. Reductions in the Aromatic Series,
J. Am. Chem. Soc., 1951, 73, 2656. [all data]
Ribeiro da Silva and Santos, 2007
Ribeiro da Silva, M.A.V.; Santos, Ana Filipa L.O.M.,
Thermochemical study of 2- and 3-alkyl substituted thiophenes,
J Therm Anal Calorim, 2007, 88, 1, 7-17, https://doi.org/10.1007/s10973-006-8326-3
. [all data]
Stephenson and Malanowski, 1987
Stephenson, Richard M.; Malanowski, Stanislaw,
Handbook of the Thermodynamics of Organic Compounds, 1987, https://doi.org/10.1007/978-94-009-3173-2
. [all data]
Eon, Pommier, et al., 1971
Eon, C.; Pommier, C.; Guiochon, G.,
Vapor pressures and second virial coefficients of some five-membered heterocyclic derivatives,
J. Chem. Eng. Data, 1971, 16, 4, 408-410, https://doi.org/10.1021/je60051a008
. [all data]
Dykyj, Svoboda, et al., 1999
Dykyj, J.; Svoboda, J.; Wilhoit, R.C.; Frenkel, M.L.; Hall, K.R.,
Vapor Pressure of Chemicals: Part A. Vapor Pressure and Antoine Constants for Hydrocarbons and Sulfur, Selenium, Tellurium and Hydrogen Containing Organic Compounds, Springer, Berlin, 1999, 373. [all data]
Aloisi and Pignataro, 1973
Aloisi, G.G.; Pignataro, S.,
Molecular complexes of substituted thiophens with σ and π acceptors,
J. Chem. Soc. Faraday Trans. 1, 1973, 69, 534. [all data]
Linda, Marino, et al., 1971
Linda, P.; Marino, G.; Pignataro, S.,
A comparison of sensitivities to substituent effects of five- membered heteroaromatic rings in gas phase ionization,
J. Chem. Soc. B, 1971, 1585. [all data]
Khvostenko, 1962
Khvostenko, V.I.,
Ionisation of thiophen and some of its derivatives by electron impact,
Zh. Fiz. Khim., 1962, 36, 384, In original 197. [all data]