1,1-Dichloro-1-silacyclo-3-pentene
- Formula: C4H6Cl2Si
- Molecular weight: 153.082
- IUPAC Standard InChIKey: KXQIMLAMKLUPJR-UHFFFAOYSA-N
- CAS Registry Number: 872-46-8
- Chemical structure:
View 3d structure (requires JavaScript / HTML 5) - Other names: Silacyclopent-3-ene,1,1-dichloro-; 1,1-Dichloro-1-silacyclopent-3-ene; 1,1-Dichloro-1-silacyclopentene-3; 1,1-Dichlorosilacyclo-3-pentene

Gas phase ion energetics data

Data compiled as indicated in comments:
LLK - Sharon G. Lias, Rhoda D. Levin, and Sherif A. Kafafi
Ionization energy determinations
IE (eV) | Method | Reference | Comment |
---|---|---|---|
9.67 | PE | Khvostenko, Zykov, et al., 1981 | Vertical value; LLK |
9.63 | PE | Bertoti, Cradock, et al., 1976 | Vertical value; LLK |

References

Khvostenko, Zykov, et al., 1981
Khvostenko, V.I.; Zykov, B.G.; Yuriev, V.P.; Mironov, V.F.; Kovel'zon, G.I.; Panasenko, A.A.; Sheludyakov, V.D.; Gailyunas, I.A.,
Study of d(π)-p(π) interaction in vinyl- and alkylsilicon-containing compounds by photoelectron spectroscopy,
J. Organomet. Chem., 1981, 218, 155. [all data]
Bertoti, Cradock, et al., 1976
Bertoti, I.; Cradock, S.; Ebsworth, E.A.V.; Whiteford, R.A.,
Photoelectron spectra and transannular interactions in 1-silacyclopent-3-enes,
J. Chem. Soc. Dalton Trans., 1976, 937. [all data]