1-Decene
- Formula: C10H20
- Molecular weight: 140.2658
- IUPAC Standard InChIKey: AFFLGGQVNFXPEV-UHFFFAOYSA-N
- CAS Registry Number: 872-05-9
- Chemical structure:
View 3d structure (requires JavaScript / HTML 5) - Other names: n-1-Decene; Dec-1-ene; 1-C10H20; Decylene; α-Decene; 1-n-Decene; Decene-1; Neodene 10; NSC 62122; Linealene 10; Gulftene 10

Gas phase thermochemistry data

Data compiled as indicated in comments:
ALS - Hussein Y. Afeefy, Joel F. Liebman, and Stephen E. Stein
DRB - Donald R. Burgess, Jr.
Quantity | Value | Units | Method | Reference | Comment |
---|---|---|---|---|---|
ΔfH°gas | -124.6 | kJ/mol | Chyd | Bretschneider and Rogers, 1970 | ALS |
ΔfH°gas | -123.4 | kJ/mol | N/A | Rockenfeller and Rossini, 1961 | Value computed using ΔfHliquid° value of -173.8±1.9 kj/mol from Rockenfeller and Rossini, 1961 and ΔvapH° value of 50.44 kj/mol from missing citation.; DRB |

Condensed phase thermochemistry data

Data compiled as indicated in comments:
ALS - Hussein Y. Afeefy, Joel F. Liebman, and Stephen E. Stein
DH - Eugene S. Domalski and Elizabeth D. Hearing
Quantity | Value | Units | Method | Reference | Comment |
---|---|---|---|---|---|
ΔfH°liquid | -173.8 ± 1.9 | kJ/mol | Ccb | Rockenfeller and Rossini, 1961 | Reanalyzed by Cox and Pilcher, 1970, Original value = -174.6 kJ/mol; ALS |
Quantity | Value | Units | Method | Reference | Comment |
ΔcH°liquid | -6619.6 ± 1.8 | kJ/mol | Ccb | Rockenfeller and Rossini, 1961 | Corresponding ΔfHºliquid = -173.8 kJ/mol (simple calculation by NIST; no Washburn corrections); ALS |
Quantity | Value | Units | Method | Reference | Comment |
S°liquid | 425.01 | J/mol*K | N/A | McCullough, Finke, et al., 1957 | DH |
Constant pressure heat capacity of liquid
Cp,liquid (J/mol*K) | Temperature (K) | Reference | Comment |
---|---|---|---|
300.83 | 298.15 | McCullough, Finke, et al., 1957 | T = 11 to 360 K.; DH |

Phase change data

Data compiled as indicated in comments:
BS - Robert L. Brown and Stephen E. Stein
TRC - Thermodynamics Research Center, NIST Boulder Laboratories, Chris Muzny director
ALS - Hussein Y. Afeefy, Joel F. Liebman, and Stephen E. Stein
AC - William E. Acree, Jr., James S. Chickos
CAL - James S. Chickos, William E. Acree, Jr., Joel F. Liebman, Students of Chem 202 (Introduction to the Literature of Chemistry), University of Missouri -- St. Louis
DH - Eugene S. Domalski and Elizabeth D. Hearing
Quantity | Value | Units | Method | Reference | Comment |
---|---|---|---|---|---|
Tboil | 440. ± 10. | K | AVG | N/A | Average of 14 values; Individual data points |
Quantity | Value | Units | Method | Reference | Comment |
Tfus | 207. ± 2. | K | AVG | N/A | Average of 6 values; Individual data points |
Quantity | Value | Units | Method | Reference | Comment |
Ttriple | 206.89 | K | N/A | McCullough, Finke, et al., 1957, 2 | Crystal phase 1 phase; Uncertainty assigned by TRC = 0.05 K; TRC |
Ttriple | 206.89 | K | N/A | McCullough and Waddington, 1957 | Uncertainty assigned by TRC = 0.06 K; IPTS-48, from fast crystallization; TRC |
Ttriple | 206.88 | K | N/A | McCullough and Waddington, 1957 | Uncertainty assigned by TRC = 0.06 K; IPTS-48, from slow crystallization; TRC |
Ttriple | 206.47 | K | N/A | Waddington, 1953 | Uncertainty assigned by TRC = 0.2 K; TRC |
Quantity | Value | Units | Method | Reference | Comment |
Tc | 617. ± 2. | K | N/A | Tsonopoulos and Ambrose, 1996 | |
Quantity | Value | Units | Method | Reference | Comment |
Pc | 22.2 ± 1.0 | bar | N/A | Tsonopoulos and Ambrose, 1996 | |
Quantity | Value | Units | Method | Reference | Comment |
Vc | 0.584 | l/mol | N/A | Tsonopoulos and Ambrose, 1996 | |
Quantity | Value | Units | Method | Reference | Comment |
ρc | 1.7 ± 0.10 | mol/l | N/A | Tsonopoulos and Ambrose, 1996 | |
Quantity | Value | Units | Method | Reference | Comment |
ΔvapH° | 50.44 | kJ/mol | N/A | Majer and Svoboda, 1985 | |
ΔvapH° | 50.43 ± 0.20 | kJ/mol | C | Mansson, Sellers, et al., 1977 | ALS |
ΔvapH° | 50.4 ± 0.2 | kJ/mol | C | Månsson, Sellers, et al., 1977 | AC |
ΔvapH° | 50.5 | kJ/mol | N/A | Reid, 1972 | AC |
Enthalpy of vaporization
ΔvapH (kJ/mol) | Temperature (K) | Method | Reference | Comment |
---|---|---|---|---|
43.8 | 398. | A | Stephenson and Malanowski, 1987 | Based on data from 383. to 445. K.; AC |
45.1 | 375. | N/A | Forziati, Camin, et al., 1950 | Based on data from 360. to 445. K.; AC |
Antoine Equation Parameters
log10(P) = A − (B / (T + C))
P = vapor pressure (bar)
T = temperature (K)
View plot Requires a JavaScript / HTML 5 canvas capable browser.
Temperature (K) | A | B | C | Reference |
---|---|---|---|---|
359.92 to 444.8 | 4.08526 | 1501.872 | -75.572 | Forziati, Camin, et al., 1950, 2 |
Enthalpy of fusion
ΔfusH (kJ/mol) | Temperature (K) | Reference | Comment |
---|---|---|---|
13.81 | 206.9 | Domalski and Hearing, 1996 | AC |
Entropy of fusion
ΔfusS (J/mol*K) | Temperature (K) | Reference | Comment |
---|---|---|---|
40.09 | 198.3 | Domalski and Hearing, 1996 | CAL |
66.73 | 206.9 |
Enthalpy of phase transition
ΔHtrs (kJ/mol) | Temperature (K) | Initial Phase | Final Phase | Reference | Comment |
---|---|---|---|---|---|
7.950 | 198.3 | crystaline, II | crystaline, I | McCullough, Finke, et al., 1957 | DH |
13.807 | 206.89 | crystaline, I | liquid | McCullough, Finke, et al., 1957 | DH |
Entropy of phase transition
ΔStrs (J/mol*K) | Temperature (K) | Initial Phase | Final Phase | Reference | Comment |
---|---|---|---|---|---|
40.09 | 198.3 | crystaline, II | crystaline, I | McCullough, Finke, et al., 1957 | DH |
66.74 | 206.89 | crystaline, I | liquid | McCullough, Finke, et al., 1957 | DH |

Reaction thermochemistry data

Data compiled by: Hussein Y. Afeefy, Joel F. Liebman, and Stephen E. Stein
Individual Reactions
By formula: H2 + C10H20 = C10H22
Quantity | Value | Units | Method | Reference | Comment |
---|---|---|---|---|---|
ΔrH° | -124.2 ± 1.2 | kJ/mol | Chyd | Rogers and Skanupong, 1974 | liquid phase; solvent: Hexane |
ΔrH° | -125.1 ± 1.3 | kJ/mol | Chyd | Bretschneider and Rogers, 1970 | liquid phase; solvent: galcial acetic acid |

Gas phase ion energetics data

Data evaluated as indicated in comments:
L - Sharon G. Lias
Data compiled as indicated in comments:
LLK - Sharon G. Lias, Rhoda D. Levin, and Sherif A. Kafafi
Quantity | Value | Units | Method | Reference | Comment |
---|---|---|---|---|---|
IE (evaluated) | 9.42 ± 0.01 | eV | N/A | N/A | L |
Ionization energy determinations
IE (eV) | Method | Reference | Comment |
---|---|---|---|
9.48 | EI | Holmes, Fingas, et al., 1981 | LLK |
9.417 ± 0.006 | PI | Rang, Martinson, et al., 1974 | LLK |
9.59 ± 0.01 | PE | Krause, Taylor, et al., 1978 | Vertical value; LLK |

Normal alkane RI, non-polar column, temperature ramp

Data compiled by: NIST Mass Spectrometry Data Center, William E. Wallace, director

Column type CapillaryCapillaryCapillaryCapillaryCapillary
Active phase Polydimethyl siloxane: CP-Sil 5 CBPetrocol DHHP-5HP-5Ultra-ALLOY-5
Column length (m) 60.100.30.60.30.
Carrier gas HeliumHeliumHeliumHelium
Substrate
Column diameter (mm) 0.250.250.320.250.25
Phase thickness (μm) 1.00.500.250.250.25
Tstart (C) 45.20.60.35.40.
Tend (C) 210.220.240.220.320.
Heat rate (K/min) 3.615.3.10.20.
Initial hold (min) 1.4515.2.1.2.
Final hold (min) 2.7230. 15.13.
I 997.989.989.989.991.
ReferenceBramston-Cook, 2013Supelco, 2012Kahriman, Tosun, et al., 2011Piyachaiseth, Jirapakkul, et al., 2011Tsuge, Ohtan, et al., 2011
Comment MSDC-RI MSDC-RI MSDC-RI MSDC-RI MSDC-RI
Column type CapillaryCapillaryCapillaryCapillaryCapillary
Active phase Ultra-ALLOY-5Ultra-ALLOY-5Ultra-ALLOY-5PONAPetrocol DH
Column length (m) 30.30.30.50.150.
Carrier gas    Nitrogen
Substrate
Column diameter (mm) 0.250.250.250.200.25
Phase thickness (μm) 0.250.250.250.501.0
Tstart (C) 40.40.40.35.40.
Tend (C) 320.320.320.200.300.
Heat rate (K/min) 20.20.20.2.1.
Initial hold (min) 2.2.2.15.
Final hold (min) 13.13.13.10.
I 991.992.992.989.989.
ReferenceTsuge, Ohtan, et al., 2011Tsuge, Ohtan, et al., 2011Tsuge, Ohtan, et al., 2011Zhang, Ding, et al., 2009Sojak, Kubinec, et al., 2006
Comment MSDC-RI MSDC-RI MSDC-RI MSDC-RI MSDC-RI
Column type CapillaryCapillaryCapillaryCapillaryCapillary
Active phase HP-5DB-5MSOV-1OV-101Ultra-2
Column length (m) 30.30. 50.50.
Carrier gas HeliumHe HeliumHe
Substrate
Column diameter (mm) 0.320.25 0.200.32
Phase thickness (μm) 0.250.25 0.500.52
Tstart (C) 40.40.50.30.40.
Tend (C) 300.250.160.100.250.
Heat rate (K/min) 4.3.2.1.4.
Initial hold (min)  1. 6.3.
Final hold (min) 5.   30.
I 988.988.8988.988.997.
ReferenceUtsunomia, Kawata, et al., 2005Shoenmakers, Oomen, et al., 2000Orav, Kailas, et al., 1999Orav, Kailas, et al., 1999, 2King, Matthews, et al., 1995
Comment MSDC-RI MSDC-RI MSDC-RI MSDC-RI MSDC-RI
Column type CapillaryCapillaryCapillaryPacked
Active phase Cross-Linked MethylsiliconeOV-101SP-2100Apiezon L
Column length (m) 25.54.30.2.
Carrier gas HeHeliumHe
Substrate    Chromosorb G-AW-DMCS
Column diameter (mm) 0.320.260.25
Phase thickness (μm)
Tstart (C) 35.50.40.25.
Tend (C) 225.240.250.
Heat rate (K/min) 4.5.4.10.
Initial hold (min) 3.0.
Final hold (min)  0.
I 988.988.987.986.
ReferenceBravo and Hotchkiss, 1993Zenkevich and Ventura, 1991Alencar, Alves, et al., 1983Dahlmann, Köser, et al., 1979
Comment MSDC-RI MSDC-RI MSDC-RI MSDC-RI

Kovats' RI, non-polar column, isothermal

Data compiled by: NIST Mass Spectrometry Data Center, William E. Wallace, director

Column type PackedCapillaryCapillaryCapillaryPacked
Active phase C78, Branched paraffinSqualaneDB-1DB-1C78, Branched paraffin
Column length (m) 3.3 10.10.3.3
Carrier gas He HeHe
Substrate     Chromosorb G HP
Column diameter (mm)   0.250.25
Phase thickness (μm)   0.250.25
Temperature (C) 130.100.140.60.130.
I 985.0982.989.990.985.1
ReferenceDallos, Sisak, et al., 2000Heinzen, Soares, et al., 1999Beens, Tijssen, et al., 1998Beens, Tijssen, et al., 1998Reddy, Dutoit, et al., 1992
Comment MSDC-RI MSDC-RI MSDC-RI MSDC-RI MSDC-RI
Column type PackedCapillaryCapillaryCapillaryCapillary
Active phase ApolaneOV-101OV-101OV-101OV-101
Column length (m) 3.7   50.
Carrier gas     He
Substrate
Column diameter (mm)     0.25
Phase thickness (μm)
Temperature (C) 130.40.60.80.110.
I 985.988.989.989.989.
ReferenceDutoit, 1991Laub and Purnell, 1988Laub and Purnell, 1988Laub and Purnell, 1988Rang, Kuningas, et al., 1987
Comment MSDC-RI MSDC-RI MSDC-RI MSDC-RI MSDC-RI
Column type CapillaryPackedCapillaryCapillaryCapillary
Active phase OV-1SE-30SE-30SE-30OV-1
Column length (m) 55.3.100.100.150.
Carrier gas N2Ar  He
Substrate  Gas Chrom Q (80-100 mesh)
Column diameter (mm) 0.21 0.50.50.50
Phase thickness (μm) 0.35
Temperature (C) 100.150.130.80.60.
I 988.6990.989.988.989.
ReferenceAnders, Anders, et al., 1985Tiess, 1984Bredael, 1982Bredael, 1982Nijs and Jacobs, 1981
Comment MSDC-RI MSDC-RI MSDC-RI MSDC-RI MSDC-RI
Column type CapillaryCapillaryCapillaryPackedCapillary
Active phase SqualaneSqualaneSqualaneSE-30Apiezon L
Column length (m)    3.045.
Carrier gas
Substrate
Column diameter (mm)     0.25
Phase thickness (μm)
Temperature (C) 100.115.86.100.100.
I 982.983.982.990.989.2
ReferenceSojak, Hrivnak, et al., 1973Sojak, Hrivnak, et al., 1973Sojak, Hrivnak, et al., 1973Bierl, Beroza, et al., 1972Eisen, Orav, et al., 1972
Comment MSDC-RI MSDC-RI MSDC-RI MSDC-RI MSDC-RI
Column type CapillaryCapillaryCapillaryPackedPacked
Active phase Apiezon LSqualaneSqualaneApiezon LApiezon L
Column length (m) 45.200.200.2.32.3
Carrier gas  N2N2N2N2
Substrate    DCMS-treated Chromosorb WDCMS-treated Chromosorb W
Column diameter (mm) 0.250.20.2
Phase thickness (μm)
Temperature (C) 120.115.86.100.150.
I 990.1982.7982.2987.988.
ReferenceEisen, Orav, et al., 1972Soják and Bucinská, 1970Soják and Bucinská, 1970Brown, Chapman, et al., 1968Brown, Chapman, et al., 1968
Comment MSDC-RI MSDC-RI MSDC-RI MSDC-RI MSDC-RI

Kovats' RI, non-polar column, temperature ramp

Data compiled by: NIST Mass Spectrometry Data Center, William E. Wallace, director

Column type CapillaryCapillaryCapillary
Active phase OV-101OV-101OV-101
Column length (m) 50.50.110.
Carrier gas   He
Substrate
Column diameter (mm) 0.230.230.25
Phase thickness (μm)   0.20
Tstart (C) 80.80.35.
Tend (C) 200.200.200.
Heat rate (K/min) 2.2.1.
Initial hold (min)
Final hold (min)
I 990.992.988.
ReferenceOhnishi and Shibamoto, 1984Ohnishi and Shibamoto, 1984Hayes and Pitzer, 1982
Comment MSDC-RI MSDC-RI MSDC-RI

Normal alkane RI, polar column, temperature ramp

Data compiled by: NIST Mass Spectrometry Data Center, William E. Wallace, director

Column type CapillaryCapillary
Active phase TC-WaxDB-Wax
Column length (m) 60.60.
Carrier gas He
Substrate
Column diameter (mm) 0.250.25
Phase thickness (μm)
Tstart (C) 80.60.
Tend (C) 240.220.
Heat rate (K/min) 3.3.
Initial hold (min)  4.
Final hold (min)
I 1020.1054.
ReferenceMiyazawa, Teranishi, et al., 2003Chung, Eiserich, et al., 1993
Comment MSDC-RI MSDC-RI

References

Bretschneider and Rogers, 1970
Bretschneider, E.; Rogers, D.W.,
A new microcalorimeter: heats of hydrogenation of four monoolefins,
Mikrochim. Acta, 1970, 482-490. [all data]
Rockenfeller and Rossini, 1961
Rockenfeller, J.D.; Rossini, F.D.,
Heats of combustion, isomerization, and formation of selected C7, C8, and C10 monoolefin hydrocarbons,
J. Phys. Chem., 1961, 65, 267-272. [all data]
Cox and Pilcher, 1970
Cox, J.D.; Pilcher, G.,
Thermochemistry of Organic and Organometallic Compounds, Academic Press, New York, 1970, 1-636. [all data]
McCullough, Finke, et al., 1957
McCullough, J.P.; Finke, H.L.; Gross, M.E.; Messerly, J.F.; Waddington, G.,
Low temperature calorimetric studies of seven 1-olefins: effect of orientational disorder in the solid state,
J. Phys. Chem., 1957, 61, 289-301. [all data]
McCullough, Finke, et al., 1957, 2
McCullough, J.P.; Finke, H.L.; Gross, M.E.; Messerly, J.F.; Waddington, G.,
Low temperature calorimetric studies of seven 1-olefins: effect of orientational disorder in the solid state,
J. Phys. Chem., 1957, 61, 289. [all data]
McCullough and Waddington, 1957
McCullough, J.P.; Waddington, G.,
Melting-point purity determinations: limitations as evidenced by calorimetric studies in the melting region,
Anal. Chim. Acta, 1957, 17, 80. [all data]
Waddington, 1953
Waddington, G.,
Personal Communication, U.S. Bur. Mines, 1953. [all data]
Tsonopoulos and Ambrose, 1996
Tsonopoulos, C.; Ambrose, D.,
Vapor-Liquid Critical Properties of Elements and Compounds. 6. Unsaturated Aliphatic Hydrocarbons,
J. Chem. Eng. Data, 1996, 41, 645-656. [all data]
Majer and Svoboda, 1985
Majer, V.; Svoboda, V.,
Enthalpies of Vaporization of Organic Compounds: A Critical Review and Data Compilation, Blackwell Scientific Publications, Oxford, 1985, 300. [all data]
Mansson, Sellers, et al., 1977
Mansson, M.; Sellers, P.; Stridh, G.; Sunner, S.,
Enthalpies of vaporization of some 1-substituted n-alkanes,
J. Chem. Thermodyn., 1977, 9, 91. [all data]
Månsson, Sellers, et al., 1977
Månsson, M.; Sellers, P.; Stridh, G.; Sunner, S.,
Enthalpies of vaporization of some 1-substituted n-alkanes,
The Journal of Chemical Thermodynamics, 1977, 9, 1, 91-97, https://doi.org/10.1016/0021-9614(77)90202-6
. [all data]
Reid, 1972
Reid, Robert C.,
Handbook on vapor pressure and heats of vaporization of hydrocarbons and related compounds, R. C. Wilhort and B. J. Zwolinski, Texas A Research Foundation. College Station, Texas(1971). 329 pages.$10.00,
AIChE J., 1972, 18, 6, 1278-1278, https://doi.org/10.1002/aic.690180637
. [all data]
Stephenson and Malanowski, 1987
Stephenson, Richard M.; Malanowski, Stanislaw,
Handbook of the Thermodynamics of Organic Compounds, 1987, https://doi.org/10.1007/978-94-009-3173-2
. [all data]
Forziati, Camin, et al., 1950
Forziati, A.F.; Camin, D.L.; Rossini, F.D.,
Density, refractive index, boiling point, and vapor pressure of eight monoolefin (1-alkene), six pentadiene, and two cyclomonoolefin hydrocarbons,
J. RES. NATL. BUR. STAN., 1950, 45, 5, 406, https://doi.org/10.6028/jres.045.044
. [all data]
Forziati, Camin, et al., 1950, 2
Forziati, a.F.; Camin, D.L.; Rossini, F.D.,
Density, refractive index, boiling point, and vapor pressure of eight monoolefin (1-alkene), six pentadiene, and two cyclomonoolefin hydrocarbons,
J. Res. NBS, 1950, 45, 406-410. [all data]
Domalski and Hearing, 1996
Domalski, Eugene S.; Hearing, Elizabeth D.,
Heat Capacities and Entropies of Organic Compounds in the Condensed Phase. Volume III,
J. Phys. Chem. Ref. Data, 1996, 25, 1, 1, https://doi.org/10.1063/1.555985
. [all data]
Rogers and Skanupong, 1974
Rogers, D.W.; Skanupong, S.,
Heats of hydrogenation of sixteen terminal monoolefins. The alternating effect,
J. Phys. Chem., 1974, 78, 2569-2572. [all data]
Holmes, Fingas, et al., 1981
Holmes, J.L.; Fingas, M.; Lossing, F.P.,
Towards a general scheme for estimating the heats of formation of organic ions in the gas phase. Part I. Odd-electron cations,
Can. J. Chem., 1981, 59, 80. [all data]
Rang, Martinson, et al., 1974
Rang, S.; Martinson, E.; Muurisepp, M.,
Ionization potentials of unsaturated hydrocarbons. 1. n-Alkenes, Eesti NSV Teaduste Akadeemia Toimetised 23,
Eesti. NSV Tead. Akad. Toim., 1974, 352. [all data]
Krause, Taylor, et al., 1978
Krause, D.A.; Taylor, J.W.; Fenske, R.F.,
An analysis of the effects of alkyl substituents on the ionization potentials of n-alkenes,
J. Am. Chem. Soc., 1978, 100, 718. [all data]