Argon, compound with mercury (1:1)
- Formula: ArHg
- Molecular weight: 240.54
- IUPAC Standard InChIKey: BKZJXSDQOIUIIG-UHFFFAOYSA-N
- CAS Registry Number: 87193-95-1
- Chemical structure:
View 3d structure (requires JavaScript / HTML 5) - Permanent link for this species. Use this link for bookmarking this species for future reference.

Gas phase ion energetics data

Data compiled as indicated in comments:
LBLHLM - Sharon G. Lias, John E. Bartmess, Joel F. Liebman, John L. Holmes, Rhoda D. Levin, and W. Gary Mallard
Ionization energy determinations
IE (eV) | Method | Reference | Comment |
---|---|---|---|
10.217 ± 0.012 | PI | Linn, Brom, et al., 1985 | LBLHLM |

References

Linn, Brom, et al., 1985
Linn, S.H.; Brom, J.M., Jr.; Tzeng, W.-B.; Ng, C.Y.,
Photoionization study of HgAr,
J. Chem. Phys., 1985, 82, 648. [all data]