Disilane, 1,2-dimethyl-
- Formula: C2H10Si2
- Molecular weight: 90.2718
- IUPAC Standard InChIKey: UPARUZSLIVQDTG-UHFFFAOYSA-N
- CAS Registry Number: 870-26-8
- Chemical structure:
View 3d structure (requires JavaScript / HTML 5) - Permanent link for this species. Use this link for bookmarking this species for future reference.

Phase change data

Data compiled by: William E. Acree, Jr., James S. Chickos
Enthalpy of vaporization
ΔvapH (kJ/mol) | Temperature (K) | Reference | Comment |
---|---|---|---|
25.4 | 258. | Craig and MacDiarmid, 1962 | Based on data from 227. to 273. K. |

Gas phase ion energetics data

Data compiled by: Sharon G. Lias, Rhoda D. Levin, and Sherif A. Kafafi
Appearance energy determinations
Ion | AE (eV) | Other Products | Method | Reference | Comment |
---|---|---|---|---|---|
CH5Si+ | 11.4 ± 0.1 | CH3SiH2 | EI | Potzinger, Ritter, et al., 1975 | |
C2H7Si+ | 10.3 ± 0.1 | SiH3 | EI | Potzinger, Ritter, et al., 1975 |

References

Craig and MacDiarmid, 1962
Craig, A.D.; MacDiarmid, A.G.,
Application of the Wurtz reaction to the synthesis of disilane and 1,2-dimethyldisilane,
Journal of Inorganic and Nuclear Chemistry, 1962, 24, 2, 163-164, https://doi.org/10.1016/S0022-1902(62)90189-6
. [all data]
Potzinger, Ritter, et al., 1975
Potzinger, P.; Ritter, A.; Krause, J.,
Massenspektrometrische Bestimmung von Bindungsenergien in siliciumorganischen Verbindungen,
Z. Naturforsch. A:, 1975, 30, 347. [all data]