4,5-Bis(dimethylamino)fluorene
- Formula: C17H20N2
- Molecular weight: 252.3541
- CAS Registry Number: 86943-85-3

Gas phase ion energetics data

Data compiled as indicated in comments:
LBLHLM - Sharon G. Lias, John E. Bartmess, Joel F. Liebman, John L. Holmes, Rhoda D. Levin, and W. Gary Mallard
Ionization energy determinations
IE (eV) | Method | Reference | Comment |
---|---|---|---|
6.7 | PE | Gleiter, Schafer, et al., 1984 | LBLHLM |
7.1 | PE | Gleiter, Schafer, et al., 1984 | Vertical value; LBLHLM |

References

Gleiter, Schafer, et al., 1984
Gleiter, R.; Schafer, W.; Staab, H.A.; Saupe, T.,
Electronic structure of 4,5-bis(dimethylamine)fluorene. PE spectroscopic investigations,
J. Org. Chem., 1984, 49, 4463. [all data]