Dimethyl phosphite
- Formula: C2H7O3P
- Molecular weight: 110.0489
- IUPAC Standard InChIKey: HZCDANOFLILNSA-UHFFFAOYSA-N
- CAS Registry Number: 868-85-9
- Chemical structure:
View 3d structure (requires JavaScript / HTML 5) - Species with the same structure:
- Isotopologues:
- Other names: Phosphonic acid, dimethyl ester; Dimethoxyphosphine oxide; Dimethyl acid phosphite; Dimethyl hydrogen phosphite; Dimethyl phosphonate; Hydrogen dimethyl phosphite; Methyl phosphonate ((MeO)2HPO); O,O-Dimethyl phosphonate; (CH3O)2PHO; Phosphorous acid dimethyl ester; Dimethylester kyseliny fosforite; Dimethylfosfit; Dimethylfosfonat; NCI-C54773; Dimethyl ester of phosphonic acid; Dimethyl hydrogen phosphonate

Phase change data

Data compiled by: William E. Acree, Jr., James S. Chickos
Quantity | Value | Units | Method | Reference | Comment |
---|---|---|---|---|---|
ΔvapH° | 46.7 | kJ/mol | GS | Butrow, Buchanan, et al., 2009 | Based on data from 243. to 443. K. |
Enthalpy of vaporization
ΔvapH (kJ/mol) | Temperature (K) | Method | Reference | Comment |
---|---|---|---|---|
46.7 | 368. | N/A | Fan and Wang, 2010 | Based on data from 353. to 443. K. |
48.3 | 243. | GS | Butrow, Buchanan, et al., 2009 | Based on data from 243. to 443. K. |
47.9 | 263. | GS | Butrow, Buchanan, et al., 2009 | Based on data from 243. to 443. K. |
46.4 | 313. | GS | Butrow, Buchanan, et al., 2009 | Based on data from 243. to 443. K. |
46.0 | 333. | GS | Butrow, Buchanan, et al., 2009 | Based on data from 243. to 443. K. |
45.4 | 373. | GS | Butrow, Buchanan, et al., 2009 | Based on data from 243. to 443. K. |
38.7 | 361. | A | Stephenson and Malanowski, 1987 | Based on data from 346. to 456. K. See also Dykyj, 1970. |

Reaction thermochemistry data

Data compiled by: John E. Bartmess
Individual Reactions
C2H6O3P- + =
By formula: C2H6O3P- + H+ = C2H7O3P
Quantity | Value | Units | Method | Reference | Comment |
---|---|---|---|---|---|
ΔrH° | 1492. ± 15. | kJ/mol | G+TS | McDonald, Chowdhury, et al., 1987 | gas phase; Acidity between MeNO2, EtSH. Acid taken as (MeO)2P(O)H. |
Quantity | Value | Units | Method | Reference | Comment |
ΔrG° | 1461. ± 15. | kJ/mol | IMRB | McDonald, Chowdhury, et al., 1987 | gas phase; Acidity between MeNO2, EtSH. Acid taken as (MeO)2P(O)H. |
ΔrG° | 1469. ± 17. | kJ/mol | IMRB | Anderson, DePuy, et al., 1984 | gas phase; Between MeSH, H2S |

Gas phase ion energetics data

Data evaluated as indicated in comments:
HL - Edward P. Hunter and Sharon G. Lias
Data compiled as indicated in comments:
B - John E. Bartmess
LLK - Sharon G. Lias, Rhoda D. Levin, and Sherif A. Kafafi
RDSH - Henry M. Rosenstock, Keith Draxl, Bruce W. Steiner, and John T. Herron
Quantity | Value | Units | Method | Reference | Comment |
---|---|---|---|---|---|
Proton affinity (review) | 894.8 | kJ/mol | N/A | Hunter and Lias, 1998 | HL |
Quantity | Value | Units | Method | Reference | Comment |
Gas basicity | 862.4 | kJ/mol | N/A | Hunter and Lias, 1998 | HL |
Ionization energy determinations
IE (eV) | Method | Reference | Comment |
---|---|---|---|
10.53 | PE | Zverev and Villem, 1980 | LLK |
10.53 | PE | Zverev, Villem, et al., 1979 | LLK |
10.5 | EI | Fischler and Halmann, 1964 | RDSH |
Appearance energy determinations
Ion | AE (eV) | Other Products | Method | Reference | Comment |
---|---|---|---|---|---|
CH4O3P+ | 11.9 | ? | EI | Fischler and Halmann, 1964 | RDSH |
C2H6O3P+ | 12.7 | H | EI | Fischler and Halmann, 1964 | RDSH |
PHO3+ | 11.2 | ? | EI | Fischler and Halmann, 1964 | RDSH |
PO+ | 16.3 | ? | EI | Fischler and Halmann, 1964 | RDSH |
PO3+ | 13.5 | ? | EI | Fischler and Halmann, 1964 | RDSH |
De-protonation reactions
C2H6O3P- + =
By formula: C2H6O3P- + H+ = C2H7O3P
Quantity | Value | Units | Method | Reference | Comment |
---|---|---|---|---|---|
ΔrH° | 1492. ± 15. | kJ/mol | G+TS | McDonald, Chowdhury, et al., 1987 | gas phase; Acidity between MeNO2, EtSH. Acid taken as (MeO)2P(O)H.; B |
Quantity | Value | Units | Method | Reference | Comment |
ΔrG° | 1461. ± 15. | kJ/mol | IMRB | McDonald, Chowdhury, et al., 1987 | gas phase; Acidity between MeNO2, EtSH. Acid taken as (MeO)2P(O)H.; B |
ΔrG° | 1469. ± 17. | kJ/mol | IMRB | Anderson, DePuy, et al., 1984 | gas phase; Between MeSH, H2S; B |

References

Butrow, Buchanan, et al., 2009
Butrow, Ann B.; Buchanan, James H.; Tevault, David E.,
Vapor Pressure of Organophosphorus Nerve Agent Simulant Compounds,
J. Chem. Eng. Data, 2009, 54, 6, 1876-1883, https://doi.org/10.1021/je8010024
. [all data]
Fan and Wang, 2010
Fan, Chuan-Lei; Wang, Li-Sheng,
Vapor Pressure of Dimethyl Phosphite and Dimethyl Methylphosphonate,
J. Chem. Eng. Data, 2010, 55, 1, 479-481, https://doi.org/10.1021/je900258f
. [all data]
Stephenson and Malanowski, 1987
Stephenson, Richard M.; Malanowski, Stanislaw,
Handbook of the Thermodynamics of Organic Compounds, 1987, https://doi.org/10.1007/978-94-009-3173-2
. [all data]
Dykyj, 1970
Dykyj, J.,
Petrochemica, 1970, 10, 2, 51. [all data]
McDonald, Chowdhury, et al., 1987
McDonald, R.M.; Chowdhury, A.K.; Gung, W.Y.; DeWitt, K.D.,
Nucleophilic Reactivity in Anionic Ion-Molecule Reactions
in Nucleophilicity, Harris, J.M, McManus, S.P. Eds., Amer. Chem. Soc, 1987. [all data]
Anderson, DePuy, et al., 1984
Anderson, D.R.; DePuy, C.H.; Filley, J.; Bierbaum, V.M.,
Gas Phase Chemistry of Trimethyl Phosphite,
J. Am. Chem. Soc., 1984, 106, 22, 6513, https://doi.org/10.1021/ja00334a009
. [all data]
Hunter and Lias, 1998
Hunter, E.P.; Lias, S.G.,
Evaluated Gas Phase Basicities and Proton Affinities of Molecules: An Update,
J. Phys. Chem. Ref. Data, 1998, 27, 3, 413-656, https://doi.org/10.1063/1.556018
. [all data]
Zverev and Villem, 1980
Zverev, V.V.; Villem, Y.Y.,
Ionizationp potentials of phosphoryl compounds,
J. Struct. Chem., 1980, 21, 22, In original 30. [all data]
Zverev, Villem, et al., 1979
Zverev, V.V.; Villem, Ya.Ya.; Bel'skii, V.E.; Kitaev, Yu.P.,
The photoelectronic spectra of phosphoryl compounds,
Izv. Akad. Nauk SSSR, Ser. Khim., 1979, 1, 84. [all data]
Fischler and Halmann, 1964
Fischler, J.; Halmann, M.,
Electron-impact studies of phosphorus compounds,
J. Chem. Soc., 1964, 31. [all data]