Carbazole
- Formula: C12H9N
- Molecular weight: 167.2066
- IUPAC Standard InChIKey: UJOBWOGCFQCDNV-UHFFFAOYSA-N
- CAS Registry Number: 86-74-8
- Chemical structure:
View 3d structure (requires JavaScript / HTML 5) - Other names: 9H-Carbazole; Dibenzopyrrole; Dibenzo[b,d]pyrrole; Diphenylenimine; 9-Azafluorene; Diphenylenimide; Diphenyleneimine; USAF EK-600; SKF 20091; NSC 3498

Gas phase thermochemistry data

Data compiled as indicated in comments:
ALS - Hussein Y. Afeefy, Joel F. Liebman, and Stephen E. Stein
DRB - Donald R. Burgess, Jr.
Quantity | Value | Units | Method | Reference | Comment |
---|---|---|---|---|---|
ΔfH°gas | 205.0 ± 3.0 | kJ/mol | Ccb | Jimenez, Roux, et al., 1990 | ALS |
ΔfH°gas | 209.6 ± 3.5 | kJ/mol | Ccr | Sabbah and Antipine, 1987 | ALS |
ΔfH°gas | 222.9 | kJ/mol | N/A | Tavernier and Lamouroux, 1957 | Value computed using ΔfHsolid° value of 125.1±3.6 kj/mol from Tavernier and Lamouroux, 1957 and ΔsubH° value of 97.8 kj/mol from Tavernier and Lamouroux, 1957.; DRB |

Condensed phase thermochemistry data

Data compiled as indicated in comments:
ALS - Hussein Y. Afeefy, Joel F. Liebman, and Stephen E. Stein
DH - Eugene S. Domalski and Elizabeth D. Hearing
Quantity | Value | Units | Method | Reference | Comment |
---|---|---|---|---|---|
ΔfH°solid | 101.7 ± 2.8 | kJ/mol | Ccb | Jimenez, Roux, et al., 1990 | ALS |
ΔfH°solid | 111.8 ± 3.5 | kJ/mol | Ccr | Sabbah and Antipine, 1987 | ALS |
ΔfH°solid | 125.1 ± 3.6 | kJ/mol | Ccb | Tavernier and Lamouroux, 1957 | Reanalyzed by Cox and Pilcher, 1970, Original value = 136.3 kJ/mol; Author's hf298_condensed=26.844 kcal/mol; ALS |
Quantity | Value | Units | Method | Reference | Comment |
ΔcH°solid | -6110.1 ± 2.3 | kJ/mol | Ccb | Jimenez, Roux, et al., 1990 | ALS |
ΔcH°solid | -6120.1 ± 3.4 | kJ/mol | Ccr | Sabbah and Antipine, 1987 | ALS |
ΔcH°solid | -6116.2 | kJ/mol | Ccb | Zimmerman and Geisenfelder, 1961 | ALS |
ΔcH°solid | -6133.5 ± 3.6 | kJ/mol | Ccb | Tavernier and Lamouroux, 1957 | Reanalyzed by Cox and Pilcher, 1970, Original value = -6144.744 kJ/mol; Author's hf298_condensed=26.844 kcal/mol; ALS |
Constant pressure heat capacity of solid
Cp,solid (J/mol*K) | Temperature (K) | Reference | Comment |
---|---|---|---|
194.0 | 298.15 | Jimenez, Roux, et al., 1990 | DH |
190.8 | 298.15 | Radomska and Radomski, 1980 | T = 180 to 410 K. Cp = 54.87 + 0.2328T + 7.477x10-4T2.; DH |

Phase change data

Data compiled as indicated in comments:
BS - Robert L. Brown and Stephen E. Stein
AC - William E. Acree, Jr., James S. Chickos
ALS - Hussein Y. Afeefy, Joel F. Liebman, and Stephen E. Stein
DRB - Donald R. Burgess, Jr.
DH - Eugene S. Domalski and Elizabeth D. Hearing
Quantity | Value | Units | Method | Reference | Comment |
---|---|---|---|---|---|
Tboil | 628.2 | K | N/A | Weast and Grasselli, 1989 | BS |
Quantity | Value | Units | Method | Reference | Comment |
ΔsubH° | 102. ± 8. | kJ/mol | AVG | N/A | Average of 7 values; Individual data points |
Reduced pressure boiling point
Tboil (K) | Pressure (bar) | Reference | Comment |
---|---|---|---|
473.2 | 0.196 | Weast and Grasselli, 1989 | BS |
Enthalpy of vaporization
ΔvapH (kJ/mol) | Temperature (K) | Method | Reference | Comment |
---|---|---|---|---|
65.7 | 540. | A | Stephenson and Malanowski, 1987 | Based on data from 525. to 631. K. See also Senseman and Nelson, 1923 and Boublik, Fried, et al., 1984.; AC |
63.3 | 525. | N/A | Sivaraman, Martin, et al., 1983 | AC |
61.8 | 565. | N/A | Sivaraman, Martin, et al., 1983 | AC |
60.8 | 605. | N/A | Sivaraman, Martin, et al., 1983 | AC |
66. | 532. | N/A | Mortimer and Murphy, 1923 | Based on data from 517. to 624. K. See also Boublik, Fried, et al., 1984.; AC |
Antoine Equation Parameters
log10(P) = A − (B / (T + C))
P = vapor pressure (bar)
T = temperature (K)
View plot Requires a JavaScript / HTML 5 canvas capable browser.
Temperature (K) | A | B | C | Reference | Comment |
---|---|---|---|---|---|
525.76 to 630.86 | 4.15037 | 2122.231 | -115.853 | Senseman and Nelson, 1923 | Coefficents calculated by NIST from author's data. |
Enthalpy of sublimation
ΔsubH (kJ/mol) | Temperature (K) | Method | Reference | Comment |
---|---|---|---|---|
101.2 ± 1.1 | 355. | ME | Jimenez, Roux, et al., 1990 | Based on data from 346. to 364. K.; AC |
Enthalpy of fusion
ΔfusH (kJ/mol) | Temperature (K) | Method | Reference | Comment |
---|---|---|---|---|
27.080 | 518.33 | N/A | Sabbah and El Watik, 1992 | DH |
27.200 | 521.1 | N/A | Radomska and Radomski, 1980 | DH |
26.9 | 518.7 | DSC | Lisicki and Jamróz, 2000 | AC |
27.2 | 516. | N/A | Domalski and Hearing, 1996 | AC |
Entropy of fusion
ΔfusS (J/mol*K) | Temperature (K) | Reference | Comment |
---|---|---|---|
52.19 | 521.1 | Radomska and Radomski, 1980 | DH |

Reaction thermochemistry data

Data compiled by: John E. Bartmess
Individual Reactions
C12H8N- + =
By formula: C12H8N- + H+ = C12H9N
Quantity | Value | Units | Method | Reference | Comment |
---|---|---|---|---|---|
ΔrH° | 1444. ± 8.8 | kJ/mol | G+TS | Taft and Bordwell, 1988 | gas phase |
ΔrH° | 1404. ± 21. | kJ/mol | EIAE | Muftakhov, Vasil'ev, et al., 1999 | gas phase |
Quantity | Value | Units | Method | Reference | Comment |
ΔrG° | 1412. ± 8.4 | kJ/mol | IMRE | Taft and Bordwell, 1988 | gas phase |

Gas phase ion energetics data

Data compiled as indicated in comments:
B - John E. Bartmess
LLK - Sharon G. Lias, Rhoda D. Levin, and Sherif A. Kafafi
RDSH - Henry M. Rosenstock, Keith Draxl, Bruce W. Steiner, and John T. Herron
Ionization energy determinations
IE (eV) | Method | Reference | Comment |
---|---|---|---|
7.57 ± 0.03 | PI | Potapov, Kardash, et al., 1972 | LLK |
7.6 ± 0.1 | EI | Rapp, Staab, et al., 1970 | RDSH |
7.2 ± 0.1 | EI | Riepe and Zander, 1969 | RDSH |
7.50 | PE | Ruscic, Kovac, et al., 1978 | Vertical value; LLK |
7.68 | PE | Haink, Adams, et al., 1974 | Vertical value; LLK |
De-protonation reactions
C12H8N- + =
By formula: C12H8N- + H+ = C12H9N
Quantity | Value | Units | Method | Reference | Comment |
---|---|---|---|---|---|
ΔrH° | 1444. ± 8.8 | kJ/mol | G+TS | Taft and Bordwell, 1988 | gas phase; B |
ΔrH° | 1404. ± 21. | kJ/mol | EIAE | Muftakhov, Vasil'ev, et al., 1999 | gas phase; B |
Quantity | Value | Units | Method | Reference | Comment |
ΔrG° | 1412. ± 8.4 | kJ/mol | IMRE | Taft and Bordwell, 1988 | gas phase; B |

Kovats' RI, non-polar column, isothermal

Data compiled by: NIST Mass Spectrometry Data Center, William E. Wallace, director

Column type CapillaryCapillary
Active phase OV-1OV-101
Column length (m) 25.50.
Carrier gas N2N2
Substrate
Column diameter (mm) 0.20.3
Phase thickness (μm) 0.33
Temperature (C) 160.140.
I 1781.1761.1
ReferenceZhang, Chen, et al., 1997Gerasimenko, Kirilenko, et al., 1981
Comment MSDC-RI MSDC-RI

References

Jimenez, Roux, et al., 1990
Jimenez, P.; Roux, M.V.; Turrion, C.,
Thermochemical properties of N-heterocyclic compounds. III. Enthalpies of combustion, vapour pressures and enthalpies of sublimation, and enthalpies of formation of 9H-carbazole, 9-methylcarbazole, and 9-ethylcarbazole,
J. Chem. Thermodyn., 1990, 22, 721-726. [all data]
Sabbah and Antipine, 1987
Sabbah, R.; Antipine, I.,
Thermodynamic study on four polycycles. Relationship between their energy values and their structure,
Bull. Soc. Chim. Fr., 1987, 392-400. [all data]
Tavernier and Lamouroux, 1957
Tavernier, P.; Lamouroux, M.,
Determinations calorimetriques relatives a vingt et une substances organiques,
Mem. Poudres, 1957, 39, 335-356. [all data]
Cox and Pilcher, 1970
Cox, J.D.; Pilcher, G.,
Thermochemistry of Organic and Organometallic Compounds, Academic Press, New York, 1970, 1-636. [all data]
Zimmerman and Geisenfelder, 1961
Zimmerman, H.; Geisenfelder, H.,
Uber die Mesomerieenergie von Azolen,
Z. Electrochem., 1961, 65, 368-371. [all data]
Radomska and Radomski, 1980
Radomska, M.; Radomski, R.,
Calorimetric studies of binary systems of 1,3,5-trinitrobenzene with naphthalene, anthracene, and carbazole. I. Phase transitions and heat capacities of the pure components and charge-transfer complexes,
Thermochim. Acta, 1980, 40, 405-414. [all data]
Weast and Grasselli, 1989
CRC Handbook of Data on Organic Compounds, 2nd Editon, Weast,R.C and Grasselli, J.G., ed(s)., CRC Press, Inc., Boca Raton, FL, 1989, 1. [all data]
Stephenson and Malanowski, 1987
Stephenson, Richard M.; Malanowski, Stanislaw,
Handbook of the Thermodynamics of Organic Compounds, 1987, https://doi.org/10.1007/978-94-009-3173-2
. [all data]
Senseman and Nelson, 1923
Senseman, C.E.; Nelson, O.A.,
Vapor Pressures of Carbazol, Observed and Calculated.,
Ind. Eng. Chem., 1923, 15, 4, 382-383, https://doi.org/10.1021/ie50160a026
. [all data]
Boublik, Fried, et al., 1984
Boublik, T.; Fried, V.; Hala, E.,
The Vapour Pressures of Pure Substances: Selected Values of the Temperature Dependence of the Vapour Pressures of Some Pure Substances in the Normal and Low Pressure Region, 2nd ed., Elsevier, New York, 1984, 972. [all data]
Sivaraman, Martin, et al., 1983
Sivaraman, A.; Martin, R.J.; Kobayashi, Riki,
A versatile apparatus to study the vapor pressures and heats of vaporization of carbazole, 9-fluorenone and 9-hydroxyfluorene at elevated temperatures,
Fluid Phase Equilibria, 1983, 12, 1-2, 175-188, https://doi.org/10.1016/0378-3812(83)85019-5
. [all data]
Mortimer and Murphy, 1923
Mortimer, F. Spencer.; Murphy, Ray v.,
The Vapor Pressures of Some Substances Found in Coal Tar.,
Ind. Eng. Chem., 1923, 15, 11, 1140-1142, https://doi.org/10.1021/ie50167a012
. [all data]
Sabbah and El Watik, 1992
Sabbah, R.; El Watik, L.,
New reference materials for the calibration (temperature and energy) of differential thermal analysers and scanning calorimeters,
J. Therm. Anal., 1992, 38(4), 855-863. [all data]
Lisicki and Jamróz, 2000
Lisicki, Zygmunt; Jamróz, Malgorzata E.,
(Solid + liquid) equilibria in (polynuclear aromatic+ tertiary amide) systems,
The Journal of Chemical Thermodynamics, 2000, 32, 10, 1335-1353, https://doi.org/10.1006/jcht.2000.0685
. [all data]
Domalski and Hearing, 1996
Domalski, Eugene S.; Hearing, Elizabeth D.,
Heat Capacities and Entropies of Organic Compounds in the Condensed Phase. Volume III,
J. Phys. Chem. Ref. Data, 1996, 25, 1, 1, https://doi.org/10.1063/1.555985
. [all data]
Taft and Bordwell, 1988
Taft, R.W.; Bordwell, F.G.,
Structural and Solvent Effects Evaluated from Acidities Measured in Dimethyl Sulfoxide and in the Gas Phase,
Acc. Chem. Res., 1988, 21, 12, 463, https://doi.org/10.1021/ar00156a005
. [all data]
Muftakhov, Vasil'ev, et al., 1999
Muftakhov, M.V.; Vasil'ev, Y.V.; Khatymov, R.V.; Mazunov, V.A.; Takhistov, V.V.; Travkin, O.V.; Yakovleva, E.V.,
Thermochemistry of negatively charged ions. II. Energetics of formation of negative ions from acridanone and some of its derivatives,
Rapid Commun. Mass Spectrom., 1999, 13, 10, 912-923, https://doi.org/10.1002/(SICI)1097-0231(19990530)13:10<912::AID-RCM585>3.0.CO;2-W
. [all data]
Potapov, Kardash, et al., 1972
Potapov, V.K.; Kardash, I.E.; Sorokin, V.V.; Sokolov, S.A.; Evlasheva, T.I.,
Photoionization of heteroaromatic compounds,
Khim. Vys. Energ., 1972, 6, 392. [all data]
Rapp, Staab, et al., 1970
Rapp, U.; Staab, H.A.; Wunsche, C.,
Skelettumlagerungen unter Elektronenbeschuss-IV: zur Struktur der C13H9- und C12H9N-Ionen bei Benzylidenaminobenztriazolen,
Org. Mass Spectrom., 1970, 3, 45. [all data]
Riepe and Zander, 1969
Riepe, W.; Zander, M.,
Massenspektroskopische Untersuchungen an Carbazolen,
Z. Naturforsch., 1969, 24a, 2017. [all data]
Ruscic, Kovac, et al., 1978
Ruscic, B.; Kovac, B.; Klasinc, L.; Gusten, H.,
Photoelectron spectroscopy of J. Heterocycl. Chem.. Fluorene analogues,
Z. Naturforsch. A:, 1978, 33, 1006. [all data]
Haink, Adams, et al., 1974
Haink, H.J.; Adams, J.E.; Huber, J.R.,
The electronic structure of aromatic amines: photoelectron spectroscopy of diphenylamine, iminobibenzyl, acridan and carbazole,
Ber. Bunsen-Ges. Phys. Chem., 1974, 78, 436. [all data]